program: Gaussian 09
title: 000266215
version: EM64L-G09RevD.01
frameworkgroup: C1[X(C12H19N5O)]
method: RPBEPBE
basis: SDD
operation: Freq
keyword: #p
keyword: freq=noraman
keyword: PBEPBE/SDD
title: #p freq=noraman PBEPBE/SDD
converged: YES YES NO NO
title: Mulliken charges:
elementType: O N N N N N C C C C C C C C C C C C H H H H H H H H H H H H H H H H H H H
charge: -0.274723 -0.084242 -0.015872 -0.168433 -0.387441 -0.503668 -0.007571 -0.391954 -0.696914 -0.684456 -0.619867 0.097025 0.191230 -0.375286 -0.367435 -0.211366 -0.250584 0.136929 0.258436 0.209665 0.203394 0.211095 0.195016 0.277492 0.218789 0.215766 0.219125 0.232029 0.253550 0.232322 0.245278 0.250972 0.228883 0.229844 0.331164 0.300663 0.301142
chargesum: 0.00000
title: Mulliken charges with hydrogens summed into heavy atoms:
elementType: O N N N N N C C C C C C C C C C C C
charge: -0.274723 -0.084242 -0.015872 -0.168433 -0.056277 0.098138 0.250866 0.021106 -0.013310 -0.030776 0.098033 0.097025 0.191230 -0.130008 -0.116463 0.017517 -0.020740 0.136929
polarizability: 2.57509723e+02 2.89416873e+01 1.91752287e+02 4.57880338e+00 -1.13153254e+00 1.12749900e+02
1716.lowfreq: -7.9208 -7.5770 -0.0006 -0.0006 -0.0001 4.3518 20.6585 27.2468 42.4837
frequency: 20.1954 26.8229 42.4454 67.8309 82.9956 105.5435 114.4954 122.2849 133.4802 137.2892 155.2008 182.5704 201.3208 202.3674 225.4997 247.9636 263.6385 291.7671 300.7700 321.3966 350.8477 379.1356 397.6590 414.9884 486.6152 512.7402 519.6533 554.1379 562.2744 574.2426 642.2780 665.9059 705.6792 718.2559 762.1383 771.4500 789.3347 798.4345 842.4295 867.4271 878.4089 889.5517 954.4445 962.0316 985.0504 992.8220 1023.0201 1027.9606 1038.3645 1044.0073 1081.2536 1105.4926 1113.3433 1118.3736 1169.5350 1174.6745 1184.1926 1191.7588 1237.8157 1253.3666 1270.8605 1274.6380 1284.5184 1292.1046 1299.5048 1340.4313 1354.3030 1372.0304 1382.0048 1389.4765 1393.7427 1425.7658 1427.6493 1429.6529 1461.3241 1464.9150 1472.1422 1474.2170 1476.0226 1480.5696 1482.0747 1490.8952 1561.6828 1582.7827 1604.7819 1679.9871 2972.8669 2977.4157 2980.7112 2981.9856 3019.0235 3034.6732 3052.3986 3073.7847 3077.9350 3079.6559 3093.4152 3119.5227 3126.1623 3135.9894 3153.7503 3168.1014 3379.3142 3491.9583 3551.2481
redmass: 3.8931 3.2839 4.8907 4.1639 4.3148 4.3263 2.3447 1.5599 1.7892 2.1202 2.4915 1.3207 1.0650 1.6271 3.9095 2.6786 4.0214 3.8727 3.7488 3.7890 3.8547 4.4653 4.6936 3.6454 4.4280 4.0135 3.3628 2.8938 3.3130 1.4339 5.8473 5.0038 4.6400 2.9036 2.3730 1.7315 1.7569 1.2831 4.6436 2.7531 1.5859 3.4135 1.3816 1.3064 1.3182 1.5031 2.3371 2.7133 2.2832 2.9837 1.8490 2.1474 1.7652 1.4440 1.0932 2.1238 3.3870 3.0008 1.8487 1.9493 2.0714 1.9355 1.2038 1.7898 1.3129 1.5638 5.8520 1.7820 4.8264 1.2082 1.2652 2.1768 1.3434 1.6419 1.0836 2.5044 1.0572 1.0464 1.0455 1.0542 1.0662 1.0747 6.3579 7.6265 6.6010 1.0621 1.0395 1.0460 1.0375 1.0479 1.0878 1.0947 1.0995 1.0995 1.0993 1.0997 1.1010 1.0980 1.0858 1.0892 1.0939 1.1004 1.0428 1.0979 1.0795
irintensity: 0.8279 0.1507 0.6653 2.6269 0.7198 0.7161 14.8334 0.3404 5.7624 4.6758 4.8373 0.1457 0.0677 1.3686 6.3292 0.9290 7.8987 17.8992 7.8567 9.4013 2.5763 9.4105 1.6515 2.1406 8.1357 8.6887 11.9439 29.9310 17.8964 109.8288 0.6332 12.9390 9.3658 9.1759 56.6053 57.9682 90.9324 6.7108 20.5025 8.4467 7.3852 6.5260 3.0920 3.0633 0.2872 33.6618 56.6448 43.7910 33.7628 7.8039 92.1684 10.5473 1.5898 36.5088 1.1445 5.5333 2.5417 3.9857 1.5503 26.8299 17.2413 64.9421 3.6536 2.1375 12.8002 1.7277 229.7788 104.8205 122.2375 16.2009 25.9767 62.8891 25.3955 138.5645 14.0260 86.6969 5.4505 3.8109 25.3115 0.9435 32.5996 0.2791 17.5964 117.9785 58.7713 26.0903 39.6809 3.1109 69.1007 65.0753 5.4562 9.2370 32.7301 2.3024 87.0723 51.6424 17.2884 11.2995 2.1187 9.2582 22.2051 28.9665 0.1462 0.8285 35.3091
temp: 298.150 k
press: 1.00000 atm
elementType: 8 7 7 7 7 7 6 6 6 6 6 6 6 6 6 6 6 6 1 1 1 1 1 1 1 1 1 1 1 1 1 1 1 1 1 1 1
symmnumber: 1
zpe: 799254.8 jmol-1
zpe.correction: 0.304420 hartree
zpe.thermalcorrener: 0.324215 hartree
zpe.thermalcorrenthalpy: 0.325160 hartree
zpe.thermalcorrgfe: 0.254890 hartree
zpe.sumelectzpe: -816.215538 hartree
zpe.sumelectthermal: -816.195743 hartree
zpe.sumelectthermalent: -816.194799 hartree
zpe.sumelectthermalfe: -816.265068 hartree
dipole: 1.6643 0.3399 -1.4614
dipole: 2.2407
quadrupole: -87.6711 -100.8561 -113.3616
quadrupole: 3.8470 0.6341 -0.6690
quadrupole: 12.9585 -0.2265 -12.7320 3.8470 0.6341 -0.6690
hfenergy: -816.5199581 hartree
pointgroup: C01 [X(C12H19N5O1)]
dipole: -0.6684636 -0.1014038 0.5657321 debye
polarizability: 256.7768544|-30.2376315|178.7364602|-4.4169786|29.6804066|126.4985949 unknown
InChI: InChI=1S/C12H19N5O/c1-4-9(2)17(3)16-15-11-8-6-5-7-10(11)12(18)14-13/h5-9,14H,4,13H2,1-3H3
charge 0 multiplicity 1
37 atoms
O  0.875244 2.08552 -0.368758
N  -2.083805 0.209494 0.54239
N  -0.772515 -0.147961 0.595902
N  -0.345103 -0.847497 -0.436366
N  2.182135 1.82037 1.531074
N  1.942584 3.139552 2.006683
C  -2.901608 0.070353 -0.703232
C  -4.383663 -0.223205 -0.378727
C  -2.705434 1.32399 -1.592163
C  -4.597264 -1.552934 0.375485
C  -2.526411 1.054814 1.656312
C  1.059276 -1.055106 -0.426011
C  2.010685 -0.072721 0.005217
C  1.526115 -2.296465 -0.934267
C  3.392907 -0.390587 -0.037276
C  2.90208 -2.593453 -0.967929
C  3.844584 -1.642357 -0.508198
C  1.60941 1.339146 0.352496
H  -2.465406 -0.800071 -1.226908
H  -4.925465 -0.251041 -1.344187
H  -4.824124 0.61909 0.191918
H  -3.182569 1.166128 -2.576435
H  -3.162362 2.220682 -1.13276
H  -1.630632 1.520563 -1.748987
H  -4.047448 -1.565152 1.334457
H  -5.667502 -1.721778 0.59283
H  -4.232278 -2.407692 -0.223268
H  -2.758471 2.081323 1.313117
H  -1.703849 1.098999 2.385814
H  -3.423183 0.634739 2.145708
H  0.781688 -3.020257 -1.281759
H  4.122964 0.370771 0.261557
H  3.240887 -3.561428 -1.353513
H  4.91684 -1.861978 -0.541762
H  2.62609 1.183829 2.194713
H  2.453635 3.822168 1.427883
H  0.931869 3.343452 1.968647
