program: Gaussian 09
title: 000266214
version: EM64L-G09RevD.01
frameworkgroup: C1[X(C8H15ClN2OS)]
method: RPBEPBE
basis: SDD
operation: Freq
keyword: #p
keyword: freq=noraman
keyword: PBEPBE/SDD
title: #p freq=noraman PBEPBE/SDD
converged: YES YES NO NO
title: Mulliken charges:
elementType: Cl S O N N C C C C C C C C H H H H H H H H H H H H H H H
charge: -0.088215 0.181986 -0.319032 -0.433637 -0.402569 -0.012479 -0.410641 -0.365790 -0.708385 -0.699276 0.307582 -0.335458 -0.548177 0.269147 0.227400 0.221739 0.252802 0.216260 0.229475 0.265612 0.260103 0.256977 0.284811 0.294265 0.241227 0.267604 0.280708 0.265960
chargesum: 0.00000
title: Mulliken charges with hydrogens summed into heavy atoms:
elementType: Cl S O N N C C C C C C C C
charge: -0.088215 0.181986 -0.319032 -0.148826 -0.108304 0.256669 0.038499 0.103271 -0.213298 -0.182196 0.307582 0.173373 -0.001509
polarizability: 1.52729894e+02 1.70799019e+00 1.26659936e+02 -2.09898299e+00 -2.20476698e+00 9.86622664e+01
1716.lowfreq: -11.4500 -5.8064 0.0014 0.0019 0.0030 14.0663 26.5781 34.4068 44.2107
frequency: 26.2491 33.2211 43.9894 68.0875 91.1799 100.1378 157.5144 196.8604 222.5585 240.2671 286.8333 329.4252 348.1083 359.1231 388.2486 437.6940 448.7236 490.1332 538.2120 595.0757 601.7096 628.3147 640.2550 696.4186 715.0574 780.1531 804.0151 852.4551 912.3587 929.7681 941.1343 954.6917 973.5831 987.3891 1039.6893 1051.9139 1076.1939 1100.8276 1136.7720 1143.5532 1160.7176 1175.9252 1199.4599 1217.8621 1236.6921 1249.9635 1269.8546 1296.7288 1301.9287 1313.5051 1337.5013 1350.1496 1367.3491 1373.8886 1435.3143 1439.9559 1441.0575 1443.1405 1447.7021 1453.8864 1463.2085 1503.4667 1623.3576 2979.9767 2990.6191 2991.6946 2994.8010 3015.1585 3024.9946 3051.2641 3053.0293 3055.6073 3064.4973 3081.4003 3093.0607 3153.1429 3544.8180 3552.7444
redmass: 5.5465 4.9676 10.0250 5.8817 4.8620 3.3415 3.7424 3.5976 3.2725 4.1166 2.0309 1.5430 1.8475 2.8942 3.1850 2.6055 2.8771 2.4823 1.3501 4.1242 4.9149 4.0212 2.8647 3.7719 8.7271 1.6272 2.7021 2.1599 2.1839 2.1260 1.7550 2.2808 2.1065 2.3300 1.8880 2.1693 2.0068 1.2290 1.6038 1.6805 1.1927 1.5166 1.4714 1.4118 1.3639 1.4190 1.2367 1.2067 1.1916 1.6479 1.4277 1.4151 1.3165 1.2997 1.1863 1.1036 1.0944 1.0932 1.2132 1.0888 1.2867 2.3224 5.0947 1.0630 1.0603 1.0656 1.0593 1.0618 1.0853 1.0990 1.0931 1.0989 1.0659 1.0994 1.1045 1.1118 1.0774 1.0768
irintensity: 0.6256 1.8883 0.5478 14.9950 7.5799 7.4296 6.0574 0.4273 1.6425 7.9917 2.9669 6.1860 24.5810 2.4385 0.8568 4.3361 4.2794 10.8981 201.4856 35.8687 6.9733 0.9708 6.5927 5.9787 10.9569 0.7269 9.6504 13.3157 11.0013 3.1188 17.2707 24.8048 10.2225 5.0082 2.5842 0.2854 7.3444 2.3100 5.6380 3.7088 7.0563 5.7996 1.1514 65.8518 176.3759 4.4928 20.0858 14.0216 22.0848 39.3325 13.5014 0.5995 5.9425 0.5624 56.6057 14.9257 20.4648 13.9856 52.4526 20.0075 5.7510 657.0535 157.9627 27.9638 28.0535 36.9120 47.6739 25.9566 18.6953 12.0385 6.6228 36.3606 22.7032 26.1531 18.2455 16.1952 20.5339 16.1310
temp: 298.150 k
press: 1.00000 atm
elementType: 17 16 8 7 7 6 6 6 6 6 6 6 6 1 1 1 1 1 1 1 1 1 1 1 1 1 1 1
symmnumber: 1
zpe: 604815.9 jmol-1
zpe.correction: 0.230362 hartree
zpe.thermalcorrener: 0.244839 hartree
zpe.thermalcorrenthalpy: 0.245783 hartree
zpe.thermalcorrgfe: 0.186321 hartree
zpe.sumelectzpe: -1355.686768 hartree
zpe.sumelectthermal: -1355.672291 hartree
zpe.sumelectthermalent: -1355.671346 hartree
zpe.sumelectthermalfe: -1355.730808 hartree
dipole: 0.7551 -1.0850 0.0796
dipole: 1.3243
quadrupole: -103.6755 -96.6810 -92.0996
quadrupole: 4.8135 -5.3549 -4.4619
quadrupole: -6.1901 0.8044 5.3858 4.8135 -5.3549 -4.4619
hfenergy: -1355.9171299 hartree
pointgroup: C01 [X(C8H15Cl1N2O1S1)]
dipole: -0.288618 0.4130572 0.1324452 debye
polarizability: 152.833766|0.9072283|124.2187798|1.6273462|8.1072035|100.9995508 unknown
InChI: InChI=1S/C8H15ClN2OS/c9-3-4-10-8(12)11-7-1-5-13-6-2-7/h7,10-11H,1-6H2
charge 0 multiplicity 1
28 atoms
Cl -4.767224 1.622259 0.126309
S  4.04707 0.941858 -0.736863
O  -0.953413 -1.890415 0.056326
N  0.232539 0.11893 0.196221
N  -1.994578 0.114262 -0.571813
C  1.453486 -0.528212 0.726171
C  2.307806 0.51216 1.492637
C  2.25515 -1.257414 -0.389158
C  2.903992 1.625465 0.608354
C  2.822172 -0.31668 -1.46133
C  -0.905169 -0.62661 -0.09519
C  -3.263785 -0.54023 -0.883006
C  -4.367018 -0.240154 0.133282
H  1.113275 -1.301798 1.43937
H  3.138297 -0.024102 1.987714
H  1.688165 0.970571 2.289901
H  1.577783 -1.993998 -0.861842
H  3.083258 -1.819799 0.083739
H  2.126373 2.243602 0.119806
H  3.539607 2.301594 1.20402
H  3.404765 -0.868795 -2.217227
H  2.019421 0.240677 -1.976063
H  0.253526 1.121467 0.006645
H  -1.98387 1.135705 -0.55977
H  -3.606201 -0.261494 -1.897377
H  -3.06557 -1.629374 -0.869102
H  -4.061222 -0.465118 1.164934
H  -5.315636 -0.735657 -0.122286
