program: Gaussian 09
title: 000266210
version: EM64L-G09RevD.01
frameworkgroup: C1[X(C11H14N4O4)]
method: RPBEPBE
basis: SDD
operation: Freq
keyword: #p
keyword: freq=noraman
keyword: PBEPBE/SDD
title: #p freq=noraman PBEPBE/SDD
converged: YES YES NO NO
title: Mulliken charges:
elementType: O O O O N N N N C C C C C C C C C C C H H H H H H H H H H H H H H
charge: -0.455190 -0.527766 -0.520201 -0.214677 -0.202470 -0.033966 -0.390339 -0.014680 -0.074165 -0.075980 -0.506285 -0.177660 -0.134170 -0.358451 0.299002 -0.242029 -0.144432 0.026339 -0.260591 0.263998 0.250243 0.258113 0.243601 0.263238 0.247448 0.223714 0.219153 0.353012 0.400713 0.266274 0.387029 0.395345 0.235826
chargesum: 0.00000
title: Mulliken charges with hydrogens summed into heavy atoms:
elementType: O O O O N N N N C C C C C C C C C C C
charge: -0.102178 -0.127053 -0.133172 -0.214677 -0.202470 -0.033966 0.005006 -0.014680 0.189834 0.174264 -0.004571 0.085578 0.113279 0.084415 0.299002 0.024245 -0.144432 0.026339 -0.024765
polarizability: 2.02710844e+02 8.29921228e+00 1.53359562e+02 4.26175346e+00 -1.28564298e+01 1.08171376e+02
1716.lowfreq: -12.3923 -6.2612 -0.0007 -0.0005 -0.0005 5.7263 44.1493 46.6280 77.8799
frequency: 44.0767 46.5951 77.8741 107.8008 118.1045 133.7332 164.6178 185.8565 237.2897 256.2396 269.1971 279.4200 290.5800 301.5001 311.7948 333.3813 357.4016 394.3913 422.0473 468.7090 487.7923 508.9211 530.2323 574.4358 599.9932 635.3958 642.6714 663.4343 673.5617 697.2894 756.9506 760.7950 788.7875 790.7129 833.9687 862.9332 882.3211 894.9452 898.3572 922.5616 933.7854 937.8186 977.2212 986.2480 1008.3114 1025.4398 1043.5150 1052.8411 1087.5531 1103.6283 1126.1917 1147.5930 1169.1137 1177.3893 1183.6084 1202.7579 1207.6642 1230.2752 1264.8323 1266.1874 1270.9983 1272.2302 1303.9568 1313.8067 1338.9418 1346.0104 1357.1680 1358.8181 1385.2679 1388.7682 1394.4667 1438.9944 1467.4517 1472.9767 1486.1084 1519.8311 1566.5634 1607.5929 1628.9443 2969.8960 2997.8508 3006.2609 3017.3575 3021.5505 3029.7143 3033.6772 3048.4828 3094.6383 3119.9958 3166.7084 3226.7427 3575.1329 3621.2208
redmass: 6.4177 6.5717 5.9994 5.6281 5.4398 5.4367 4.3423 6.0499 4.0858 3.4585 5.0558 2.5437 2.5403 1.6908 2.0627 2.3290 5.7066 5.1045 3.9177 5.3399 9.5978 3.6857 4.9266 3.3417 7.0166 3.6397 3.3847 11.3911 4.2337 4.4438 1.6229 1.4022 4.7467 4.1064 4.1214 6.0572 2.5653 1.6133 2.9938 2.0571 2.7852 6.1864 1.3672 3.0950 2.1726 2.5660 2.8275 3.2550 2.0433 2.7091 2.8367 1.6593 1.1708 1.9444 1.4611 1.5838 1.4518 1.2763 2.2687 1.3565 1.2476 1.3356 1.5089 1.4696 6.0009 1.4694 1.3960 1.5283 4.6026 1.3425 1.4748 3.4350 1.1674 1.0967 1.1630 6.8651 2.8803 2.5699 11.6428 1.0579 1.0838 1.0893 1.0894 1.0857 1.0659 1.1051 1.0859 1.1042 1.0920 1.0674 1.0981 1.0665 1.0672
irintensity: 0.8780 1.7040 0.5487 3.0806 1.7435 6.2552 7.2428 3.4785 19.9040 6.2986 1.7743 27.3247 80.5763 97.7089 50.7362 31.4884 1.6452 10.2164 14.3977 2.1371 14.0939 1.8323 10.8417 3.9459 1.8627 25.2456 9.4437 2.1725 9.4336 1.5696 44.1531 89.1718 14.8741 1.2171 11.9624 25.4579 16.6522 22.4453 11.8368 8.1155 74.3001 70.5111 77.4007 8.0993 78.1168 15.9923 3.7748 8.1282 36.8330 32.3947 37.1867 2.8393 26.6973 16.1155 60.7961 13.7960 24.6973 4.1740 1.6755 9.5805 11.4393 0.8830 1.7459 3.5348 50.0705 2.2794 7.8460 7.4346 32.0990 19.6314 19.0169 4.0438 35.4958 16.2011 64.4348 229.3525 69.1676 84.8062 489.1543 89.4392 70.6027 721.8376 402.2517 215.8045 10.1284 70.7978 4.0907 14.8245 21.3266 367.9935 0.0896 11.8285 22.3013
temp: 298.150 k
press: 1.00000 atm
elementType: 8 8 8 8 7 7 7 7 6 6 6 6 6 6 6 6 6 6 6 1 1 1 1 1 1 1 1 1 1 1 1 1 1
symmnumber: 1
zpe: 671025.9 jmol-1
zpe.correction: 0.255580 hartree
zpe.thermalcorrener: 0.271900 hartree
zpe.thermalcorrenthalpy: 0.272844 hartree
zpe.thermalcorrgfe: 0.211961 hartree
zpe.sumelectzpe: -946.030118 hartree
zpe.sumelectthermal: -946.013798 hartree
zpe.sumelectthermalent: -946.012854 hartree
zpe.sumelectthermalfe: -946.073737 hartree
dipole: 17.9641 -0.7542 0.0099
dipole: 17.9800
quadrupole: -144.9343 -107.0517 -102.1080
quadrupole: -11.8157 -9.4356 6.1038
quadrupole: -26.9030 10.9796 15.9234 -11.8157 -9.4356 6.1038
hfenergy: -946.2856978 hartree
pointgroup: C01 [X(C11H14N4O4)]
dipole: 7.0719188 -0.1185803 0.1160701 debye
polarizability: 201.7011367|-11.0129355|153.9287996|-3.2213819|-13.7706506|108.6118461 unknown
InChI: InChI=1S/C11H14N4O4/c16-2-5-1-6(9(18)8(5)17)15-4-14-7-10(15)12-3-13-11(7)19/h3-6,8-9,12,16-18H,1-2H2
charge 0 multiplicity 1
33 atoms
O  2.18565 -2.377132 -1.470019
O  1.955446 1.301774 -0.994817
O  3.339495 2.130886 1.020288
O  -4.826496 0.814834 0.238347
N  -0.536509 -1.088463 0.361075
N  -2.753122 -1.442293 0.844355
N  -0.754625 1.228989 -0.574235
N  -3.020509 2.09197 -0.592746
C  0.910611 -1.344933 0.308545
C  3.091035 -0.261139 0.592339
C  1.747899 -0.507177 1.328632
C  1.560283 -1.099467 -1.097278
C  2.633553 -0.006824 -0.870652
C  4.005689 0.813002 1.192475
C  -1.229314 0.063623 -0.003601
C  -1.52422 -1.967451 0.872662
C  -2.592306 -0.154238 0.29144
C  -3.591285 0.889972 0.008686
C  -1.730838 2.197249 -0.840504
H  1.042628 -2.422087 0.510832
H  3.669396 -1.207739 0.582985
H  1.248006 0.452353 1.547116
H  1.878489 -1.045965 2.281856
H  0.823232 -0.775788 -1.856708
H  3.45608 -0.067132 -1.609023
H  4.173202 0.618398 2.269748
H  4.983379 0.824764 0.669235
H  2.439783 -2.359557 -2.426811
H  2.429854 1.934401 -0.361869
H  -1.263528 -2.960147 1.234454
H  3.861962 2.860977 1.428338
H  0.262611 1.363696 -0.805271
H  -1.345332 3.116342 -1.299576
