program: Gaussian 09
title: 000266209
version: EM64L-G09RevD.01
frameworkgroup: C1[X(C12H16N4O3S)]
method: RPBEPBE
basis: SDD
operation: Freq
keyword: #p
keyword: freq=noraman
keyword: PBEPBE/SDD
title: #p freq=noraman PBEPBE/SDD
converged: NO YES NO NO
title: Mulliken charges:
elementType: S O O O N N N N C C C C C C C C C C C C H H H H H H H H H H H H H H H H
charge: 0.281994 -0.452619 -0.470939 -0.495479 -0.194174 -0.052311 -0.049732 0.003721 -0.058420 -0.117323 -0.512502 -0.113815 -0.179133 -0.416010 0.133139 -0.206736 0.097668 -0.357426 -0.389989 -0.824281 0.246574 0.249057 0.239514 0.251249 0.249818 0.229508 0.214489 0.264225 0.361465 0.380144 0.272249 0.366855 0.243252 0.281936 0.280854 0.243175
chargesum: 0.00000
title: Mulliken charges with hydrogens summed into heavy atoms:
elementType: S O O O N N N N C C C C C C C C C C C C
charge: 0.281994 -0.091154 -0.090794 -0.128623 -0.194174 -0.052311 -0.049732 0.003721 0.188154 0.131734 -0.021739 0.136003 0.050375 0.062705 0.133139 0.065513 0.097668 -0.357426 -0.146736 -0.018316
polarizability: 2.60098883e+02 9.92784066e+00 1.86094393e+02 6.46797465e+00 1.08252801e+01 1.14392491e+02
1716.lowfreq: -21.1647 -9.3545 -6.4892 -0.0020 0.0008 0.0009 30.1187 33.1966 37.5394
frequency: 29.3362 32.7389 37.2294 56.3844 75.1954 102.2223 106.0586 121.0477 141.0684 165.8185 194.5653 215.4492 229.1417 256.0336 276.8133 281.3882 305.2641 331.1026 338.2082 358.9187 396.9327 404.0114 418.9714 469.0951 498.2939 545.2156 550.8397 568.4249 588.3990 626.3939 629.4960 644.8311 650.5061 656.5839 669.2903 751.0515 791.4943 807.6558 821.7243 839.4281 879.0219 903.4281 915.9667 938.7631 957.9253 977.5430 984.9442 991.3791 1006.9814 1016.3921 1043.8124 1078.0318 1092.3501 1101.0887 1109.5330 1137.0225 1158.6955 1175.3927 1197.5154 1201.7614 1216.6864 1232.2238 1243.1221 1253.6162 1270.9114 1274.9073 1290.6721 1294.4543 1300.7167 1305.8420 1343.7557 1344.2881 1355.9721 1363.5841 1374.0847 1394.2097 1405.1053 1408.0288 1434.2289 1444.1371 1448.8094 1450.9206 1467.7508 1481.1797 1515.0081 1542.8169 2968.7297 2974.5749 2994.1239 3022.7626 3026.7959 3031.1412 3036.7845 3052.3481 3086.6274 3152.0280 3158.7700 3164.4443 3233.1244 3289.5471 3557.5614 3597.3171
redmass: 6.1914 5.5696 4.7863 6.7984 3.6617 1.3740 4.9585 2.6898 3.3069 4.2808 5.2760 6.3373 4.2631 4.7603 3.1001 3.7398 3.8139 2.9580 1.6568 4.3911 1.7739 5.0443 2.6116 3.6848 4.1196 4.9759 4.4866 7.5053 3.5200 1.2106 6.9607 3.9513 4.2178 7.1294 5.9861 3.3695 6.0898 3.5663 5.4440 1.5944 2.4351 6.2346 1.4343 5.9089 2.1573 1.1811 3.1788 1.3346 2.3991 4.7657 1.8966 3.2063 2.8591 3.7363 4.7138 2.0044 1.5539 2.6857 1.3536 1.7642 1.5854 1.4255 1.2891 1.3715 1.9675 1.3138 1.7120 3.6177 1.5974 2.7833 1.2670 1.2524 1.8128 1.4158 2.9562 1.5789 1.4315 1.5284 1.0525 3.2989 1.1047 1.2719 1.0898 1.0892 7.5259 9.1017 1.0791 1.0614 1.0859 1.0674 1.0282 1.0921 1.0852 1.0976 1.1035 1.1043 1.1055 1.0919 1.0987 1.0674 1.0657 1.0667
irintensity: 0.4656 2.3133 2.7322 0.7152 4.7539 0.6168 3.3190 0.2963 4.5681 2.4241 12.4484 8.8973 4.1041 1.2559 5.0829 5.3670 27.5977 24.6585 52.6852 7.1798 84.7483 33.2277 39.5338 19.1954 14.9099 1.9552 27.7494 20.1209 7.1768 134.3424 4.0974 15.7162 17.4998 3.0421 0.8877 13.1618 5.6219 28.3464 21.5350 11.6503 18.8104 58.6006 10.9212 61.4203 25.2668 6.8767 55.0612 1.0733 2.3230 38.8123 71.2683 22.0644 37.6275 17.6738 28.2520 37.0508 13.3374 70.8927 49.6920 26.2337 1.0194 12.2525 6.8324 28.8969 25.4855 10.9682 76.5058 48.3238 12.5341 35.3577 1.4460 3.0845 19.3256 32.6726 12.4845 48.1041 9.6207 0.3860 14.3670 47.3255 53.4824 80.3407 12.5705 14.2565 195.0715 118.9454 29.6681 17.7332 40.0756 23.2838 23.2696 2.8535 14.5954 49.5589 28.0169 8.2757 9.9113 14.3115 0.0551 274.9125 17.0365 11.4270
temp: 298.150 k
press: 1.00000 atm
elementType: 16 8 8 8 7 7 7 7 6 6 6 6 6 6 6 6 6 6 6 6 1 1 1 1 1 1 1 1 1 1 1 1 1 1 1 1
symmnumber: 1
zpe: 733633.1 jmol-1
zpe.correction: 0.279426 hartree
zpe.thermalcorrener: 0.298641 hartree
zpe.thermalcorrenthalpy: 0.299585 hartree
zpe.thermalcorrgfe: 0.230414 hartree
zpe.sumelectzpe: -1308.091102 hartree
zpe.sumelectthermal: -1308.071887 hartree
zpe.sumelectthermalent: -1308.070943 hartree
zpe.sumelectthermalfe: -1308.140114 hartree
dipole: -1.3628 3.7777 -2.1211
dipole: 4.5418
quadrupole: -132.7332 -116.4871 -123.3622
quadrupole: 4.0906 9.5993 4.9108
quadrupole: -8.5391 7.7071 0.8320 4.0906 9.5993 4.9108
hfenergy: -1308.3705279 hartree
pointgroup: C01 [X(C12H16N4O3S1)]
dipole: 0.6044217 1.2963385 1.0710195 debye
polarizability: 259.6784641|-12.5627851|188.1582277|-0.4193462|3.0483382|112.7490755 unknown
InChI: InChI=1S/C12H16N4O3S/c1-20-12-8-11(13-4-14-12)16(5-15-8)7-2-6(3-17)9(18)10(7)19/h4-7,9-10,17-19H,2-3H2,1H3
charge 0 multiplicity 1
36 atoms
S  -4.953178 -0.157184 -0.074097
O  2.072844 -1.874539 -2.133529
O  4.260484 0.232142 -1.550245
O  4.173641 2.259132 0.177919
N  -0.056989 -1.379333 0.146028
N  -2.242558 -2.10042 0.02782
N  -0.455373 1.080165 0.130799
N  -2.845685 1.61969 0.022746
C  1.414834 -1.456867 0.184194
C  3.292131 0.08863 0.834207
C  2.062452 -0.702325 1.398482
C  2.102695 -0.87849 -1.068489
C  3.52542 -0.553834 -0.568937
C  2.978457 1.59497 0.768017
C  -0.848262 -0.227885 0.1113
C  -0.948777 -2.46207 0.084642
C  -2.201908 -0.696461 0.045041
C  -3.208432 0.304212 0.00385
C  -1.514982 1.939019 0.082339
C  -5.741066 1.552606 -0.107495
H  1.664189 -2.532873 0.21971
H  4.184325 -0.041622 1.471732
H  2.371568 -1.422063 2.174848
H  1.329917 -0.01724 1.857898
H  1.608635 0.060053 -1.392725
H  4.06821 -1.514142 -0.44154
H  2.80654 1.983816 1.791207
H  2.076417 1.790445 0.156664
H  2.635708 -1.536298 -2.876401
H  4.425682 1.139872 -1.15206
H  -0.590936 -3.489699 0.074459
H  4.023341 3.232602 0.100787
H  -1.279837 3.007316 0.090369
H  -5.396371 2.103221 -0.993296
H  -5.469083 2.105191 0.802086
H  -6.825754 1.369065 -0.151332
