program: Gaussian 09
title: 000266207
version: EM64L-G09RevD.01
frameworkgroup: C1[X(C7H11N3O2)]
method: RPBEPBE
basis: SDD
operation: Freq
keyword: #p
keyword: freq=noraman
keyword: PBEPBE/SDD
title: #p freq=noraman PBEPBE/SDD
converged: YES YES NO NO
title: Mulliken charges:
elementType: O O N N N C C C C C C C H H H H H H H H H H H
charge: -0.271246 -0.241555 -0.157030 -0.371471 0.037446 -0.463857 -0.428922 0.347839 -0.018162 -0.038280 -0.543539 -0.559171 0.260445 0.242475 0.227513 0.258607 0.342144 0.249130 0.238148 0.219943 0.227427 0.223772 0.218345
chargesum: 0.00000
title: Mulliken charges with hydrogens summed into heavy atoms:
elementType: O O N N N C C C C C C C
charge: -0.271246 -0.241555 -0.157030 -0.029327 0.037446 0.039063 0.057197 0.347839 0.230968 0.199868 -0.096169 -0.117055
polarizability: 1.50808060e+02 -1.50441263e+00 9.84374223e+01 6.52623811e+00 3.17144934e+00 7.52697547e+01
1716.lowfreq: -7.4196 -3.8185 -0.0010 -0.0009 -0.0008 2.8436 29.8862 34.6384 56.1252
frequency: 29.5198 34.5292 56.1063 70.8697 87.0412 97.9983 152.0277 196.7976 256.3018 266.7545 299.8424 337.2108 359.1944 414.7504 449.4705 455.0367 502.7604 641.2570 663.3631 703.7337 714.3464 727.3568 818.2091 861.4810 902.6823 926.8863 958.1178 962.4272 981.1259 998.7976 1006.1527 1011.2258 1028.1913 1141.2920 1147.0816 1169.0394 1235.5981 1253.2084 1283.3283 1283.6245 1303.1662 1333.5802 1341.2239 1368.9428 1421.8127 1429.1301 1436.0299 1469.2634 1493.5208 1653.5652 1658.4283 1660.1454 2991.8336 3033.4357 3055.4620 3089.7140 3092.9243 3099.0857 3109.8255 3123.9975 3201.5760 3203.6285 3502.5753
redmass: 4.2888 3.6620 3.6765 4.4397 4.2102 2.2292 3.5579 3.8977 4.4785 5.0049 4.1136 3.6383 2.6571 2.0351 3.1148 6.5712 2.2187 1.7412 2.1491 3.4328 1.4887 3.7449 3.2182 2.5420 1.5699 1.9954 1.3273 1.3349 1.9510 2.5310 1.3156 1.2031 2.9533 2.3459 2.4771 2.5314 2.4543 1.3204 1.2329 1.2238 1.3434 1.2463 1.3149 8.4833 1.1403 1.1954 1.1476 1.0878 1.9312 7.8861 4.6687 5.1398 1.0610 1.0573 1.1004 1.0604 1.0613 1.1014 1.0951 1.0971 1.1142 1.1150 1.0776
irintensity: 0.1610 0.4800 0.7679 1.6492 6.2370 0.0900 3.2473 5.5294 0.3820 22.1793 7.6073 4.4613 4.1104 11.8651 0.9154 2.0931 2.2001 11.4864 56.5940 7.3564 121.6128 8.5234 9.6185 137.4701 18.2932 9.2736 73.5789 88.7495 14.4408 86.9412 33.8343 31.0101 12.0968 19.2058 29.9368 2.4237 17.9030 95.8936 1.1331 1.5553 41.4856 4.6703 16.9064 151.4591 17.6247 24.8419 18.4690 27.8263 410.6855 167.7698 5.4000 102.2452 39.5250 11.4407 4.8364 11.6306 5.1796 1.3521 8.9693 5.3747 22.1265 18.2255 45.0187
temp: 298.150 k
press: 1.00000 atm
elementType: 8 8 7 7 7 6 6 6 6 6 6 6 1 1 1 1 1 1 1 1 1 1 1
symmnumber: 1
zpe: 469878.8 jmol-1
zpe.correction: 0.178967 hartree
zpe.thermalcorrener: 0.192275 hartree
zpe.thermalcorrenthalpy: 0.193219 hartree
zpe.thermalcorrgfe: 0.136944 hartree
zpe.sumelectzpe: -587.028527 hartree
zpe.sumelectthermal: -587.015219 hartree
zpe.sumelectthermalent: -587.014275 hartree
zpe.sumelectthermalfe: -587.070550 hartree
dipole: -1.5929 -0.1528 0.2745
dipole: 1.6236
quadrupole: -60.6047 -83.2829 -67.7570
quadrupole: -6.3371 0.6197 -3.3758
quadrupole: 9.9435 -12.7347 2.7911 -6.3371 0.6197 -3.3758
hfenergy: -587.2074939 hartree
pointgroup: C01 [X(C7H11N3O2)]
dipole: 0.6261764 0.0935372 0.0847606 debye
dipolederiv: -0.7860687 -0.046555 0.0387007 0.1419833 -0.7095725 0.3692937 -0.1406167 0.3200313 -0.6888629 -0.6205071 -0.6671336 0.447882 -0.1525836 -0.5156916 0.2346261 0.1213024 0.2560325 -0.3739859 -0.7833304 -0.1272068 0.1232001 -0.5158247 -0.7139529 0.35158 0.54266 0.4765131 -0.5209064 -1.4748243 0.1200539 -0.2087488 0.132227 -0.423108 -0.0241575 -0.3703105 0.0117873 -0.5327162 0.0266127 0.5496534 -0.3352208 0.3912744 0.7522353 -0.59418 -0.4163104 -0.688978 0.495142 0.342012 -0.1369376 0.0585468 -0.1643636 0.103438 0.1402987 0.1182998 -0.0095748 0.2064101 0.7270221 0.0236108 -0.0108 0.3178768 0.206881 0.1272726 -0.1899711 0.0378514 0.1695611 2.2522705 0.1920002 -0.0941571 -0.1086118 0.8782683 -0.6061297 0.183457 -0.5208511 0.8133571 -0.0481991 0.0524235 -0.1674464 -0.0418402 0.1902586 0.0633782 -0.2137531 0.1122154 -0.1631239 -0.0154755 -0.1160005 0.1178608 -0.142811 -0.023001 0.1343829 0.24559 0.1081406 0.0686571 -0.2064463 0.1029127 -0.1216026 0.1407612 0.0331948 0.0865793 -0.1021773 0.0465298 -0.2235592 -0.2352259 -0.1240024 0.0196689 -0.1275836 -0.157831 0.2073469 -0.0193609 0.2050673 -0.0758979 0.1022657 0.0471201 0.0733453 0.0956165 0.0722604 0.011758 0.0171946 0.0005329 -0.0259315 -0.0091587 -0.0239774 -0.0277682 -0.0544532 -0.0099936 -0.0413358 0.0659086 0.0384947 0.1157254 -0.1245066 0.0662493 0.0578439 0.0457547 -0.0246112 -0.127287 0.0502795 -0.0644234 0.0383268 0.0943259 0.0475905 -0.0717812 -0.084882 0.0315877 0.0431457 0.0089957 0.0545658 0.0460987 0.2885093 -0.0143456 -0.0065385 0.0402873 0.2525141 0.0729024 0.0060904 0.0668037 0.2648176 0.0749726 -0.0986097 0.0515677 -0.0568044 -0.0429805 -0.0364271 0.0658851 -0.0089815 0.1070178 0.0728633 0.0986366 0.0316951 0.0884332 0.0229017 -0.1048513 -0.0282859 -0.0961172 0.007015 0.0909662 0.0375835 0.0721228 0.0476533 -0.0365881 -0.1025875 0.0989413 -0.1071761 0.1116018 0.0953134 -0.0659217 0.0421224 -0.1108684 -0.0421949 -0.0020801 0.0423579 -0.0167537 0.1376474 0.0486015 0.0062081 -0.0982443 0.0217274 0.1173553 -0.0895432 -0.1282782 -0.0874191 -0.0164951 0.0880074 0.0766477 0.0077512 0.0970313 0.0386301 -0.1139852 0.0421018 -0.1342908 0.0401011 unknown
polarizability: 150.842588|-5.7513858|89.2109605|-2.2922436|-11.9548118|84.4616887 unknown
InChI: InChI=1S/C7H11N3O2/c1-3-5-8-7(11)10(9-12)6-4-2/h3-4,8H,1-2,5-6H2
charge 0 multiplicity 1
23 atoms
O  0.247337 1.142007 -1.579797
O  -2.017406 -1.908062 1.025438
N  -0.986571 -0.398395 -0.304752
N  1.383928 -0.352043 -0.164743
N  -0.899823 -1.420501 0.645302
C  -2.279676 0.115911 -0.835031
C  2.743055 0.130072 -0.474294
C  0.268637 0.198821 -0.739996
C  -2.773349 1.325589 -0.060173
C  3.488408 0.54795 0.77845
C  -3.878177 1.318387 0.724503
C  4.688163 0.040252 1.154368
H  -2.100989 0.380903 -1.890459
H  -2.999846 -0.716947 -0.76695
H  3.3098 -0.655254 -1.010444
H  2.620393 0.986388 -1.162916
H  1.245359 -1.109014 0.512063
H  -2.177885 2.240327 -0.183591
H  2.997833 1.320026 1.388435
H  -4.209602 2.220984 1.250113
H  -4.478191 0.411327 0.86575
H  5.20109 0.388324 2.057335
H  5.195614 -0.733751 0.564387
