program: Gaussian 09
title: 000266205
version: EM64L-G09RevD.01
frameworkgroup: C1[X(C12H13N5O)]
method: RPBEPBE
basis: SDD
operation: Freq
keyword: #p
keyword: freq=noraman
keyword: PBEPBE/SDD
title: #p freq=noraman PBEPBE/SDD
converged: YES YES NO NO
title: Mulliken charges:
elementType: O N N N N N C C C C C C C C C C C C H H H H H H H H H H H H H
charge: -0.294271 -0.454742 -0.161022 -0.120850 -0.625586 -0.578863 0.436566 0.237837 -0.026064 0.453117 -0.460241 -0.317285 -0.372471 -0.388587 0.182201 -0.809617 0.004523 -0.159697 0.291508 0.216424 0.305308 0.230779 0.225799 0.224764 0.223399 0.235245 0.137187 0.321334 0.380476 0.328820 0.334010
chargesum: 0.00000
title: Mulliken charges with hydrogens summed into heavy atoms:
elementType: O N N N N N C C C C C C C C C C C C
charge: -0.294271 -0.163234 -0.161022 -0.120850 0.076224 0.083967 0.436566 0.237837 -0.026064 0.453117 -0.243817 -0.011977 -0.141692 -0.162788 0.182201 -0.126209 0.004523 -0.022510
polarizability: 3.05897502e+02 -8.69094640e+00 2.10544148e+02 -7.29661121e-01 -2.11957810e-01 7.15148968e+01
1716.lowfreq: -31.6204 -5.6894 0.0004 0.0007 0.0010 2.6301 5.4456 31.4797 42.5012
frequency: -31.2929 31.2530 42.4998 56.6857 84.7463 137.0761 187.1042 200.2110 204.3999 225.2414 232.7615 300.0919 304.8503 343.1594 348.1655 355.8712 411.2801 412.1525 476.8220 482.8411 510.4184 521.2102 547.6608 551.8891 596.5684 628.0315 629.5245 643.3563 678.6558 714.1351 719.5917 734.7292 753.2324 777.6115 778.1287 820.1454 836.9359 837.2162 853.3256 918.1257 943.1375 965.2151 985.1200 990.6570 1002.8168 1009.9357 1046.4706 1112.8317 1135.7049 1165.8690 1191.7238 1223.4650 1258.2590 1265.3972 1294.9289 1325.2075 1362.7028 1396.0985 1397.0550 1404.5228 1414.2327 1439.9432 1451.0439 1471.6737 1473.0565 1491.2918 1508.9520 1537.2814 1559.6561 1585.3215 1591.2478 1611.5114 1621.5762 1628.2942 2867.0271 2972.6375 3053.2740 3082.7371 3102.1076 3122.7496 3135.7113 3201.2668 3295.3555 3527.0503 3557.2759 3622.8301 3717.3137
redmass: 1.0243 4.0482 4.5991 4.4821 5.0702 4.4742 3.6421 6.5189 6.9504 5.5956 4.4338 3.2446 5.3819 3.0791 3.6409 3.0419 3.3904 5.3532 3.5440 1.2174 2.3946 5.5629 1.0672 8.1899 1.2209 1.4005 5.7275 6.4374 4.8925 5.4608 3.8335 6.3926 4.3854 5.6809 5.2200 1.4844 1.2203 5.2477 1.2874 1.8192 1.3476 2.3258 1.4755 1.3271 3.5794 2.8196 1.5460 1.8109 1.8683 2.1647 1.1102 2.6296 2.9458 4.0620 2.0741 2.1110 4.9684 1.7976 1.2811 3.6108 3.4785 2.1413 3.8046 1.1377 1.0638 2.6795 2.7046 4.5478 3.1039 4.7863 1.6810 2.4251 2.1105 6.1739 1.0828 1.0388 1.0948 1.0997 1.0880 1.0909 1.0957 1.0938 1.0618 1.0750 1.0443 1.0909 1.1059
irintensity: 0.5172 0.2593 0.1541 0.3685 0.1357 0.1013 0.9079 6.8410 0.3642 20.1940 0.9332 2.9840 5.9033 18.6740 0.9784 1.1862 1.3924 3.8389 0.2792 235.3901 60.1155 14.6083 2.3254 0.7970 169.5938 52.3879 10.0213 5.8880 0.0287 0.1739 0.3986 0.1239 3.6052 10.1661 9.8340 50.4812 157.3306 8.8002 27.4161 3.1269 4.2794 7.8770 0.7600 4.4292 3.4077 5.8136 22.3689 16.5549 1.7428 12.3913 2.3002 1.1280 8.8939 51.3754 18.5464 12.1722 34.2372 98.9711 8.8894 303.0873 68.1442 62.5670 77.5434 66.7081 20.0245 132.5315 291.5809 1207.9967 8.3281 814.1138 260.5653 257.3288 247.6374 5.6702 128.7426 51.9713 24.7086 18.3861 19.2400 24.2090 20.6487 10.5616 104.6085 16.6094 128.6666 83.0602 46.8356
temp: 298.150 k
press: 1.00000 atm
elementType: 8 7 7 7 7 7 6 6 6 6 6 6 6 6 6 6 6 6 1 1 1 1 1 1 1 1 1 1 1 1 1
symmnumber: 1
zpe: 634064.1 jmol-1
zpe.correction: 0.241502 hartree
zpe.thermalcorrener: 0.256959 hartree
zpe.thermalcorrenthalpy: 0.257903 hartree
zpe.thermalcorrgfe: 0.198089 hartree
zpe.sumelectzpe: -812.824846 hartree
zpe.sumelectthermal: -812.809389 hartree
zpe.sumelectthermalent: -812.808445 hartree
zpe.sumelectthermalfe: -812.868260 hartree
dipole: -2.1437 2.5807 0.0653
dipole: 3.3555
quadrupole: -95.2557 -93.4198 -111.4823
quadrupole: 12.2847 -0.3306 -0.1208
quadrupole: 4.7969 6.6328 -11.4296 12.2847 -0.3306 -0.1208
hfenergy: -813.0663484 hartree
pointgroup: C01 [X(C12H13N5O1)]
dipole: -0.8100458 -1.0252714 -0.1882832 debye
polarizability: 305.2112115|11.9743919|207.4820867|-0.170107|22.5236961|75.2632488 unknown
InChI: InChI=1S/C12H13N5O/c1-7-2-4-8(5-3-7)15-11-9(6-18)10(13)16-12(14)17-11/h2-6,15H,13-14H2,1H3
charge 0 multiplicity 1
31 atoms
O  3.417833 2.867425 0.390949
N  -0.27878 0.825496 0.080334
N  0.828701 -1.230378 -0.277618
N  3.282848 -1.376521 -0.332849
N  4.597366 0.52339 -0.020945
N  1.934017 -3.249141 -0.636908
C  -1.644434 0.423432 0.034785
C  0.898916 0.109288 -0.052222
C  2.173762 0.808169 0.052482
C  -4.451434 -0.167353 -0.015855
C  -2.610878 1.453304 0.206906
C  -2.091963 -0.909502 -0.160625
C  -3.986889 1.158492 0.182833
C  -3.475896 -1.182531 -0.180855
C  3.355133 -0.028471 -0.103082
C  -5.936528 -0.480029 -0.07457
C  2.024635 -1.899554 -0.407031
C  2.308031 2.223891 0.294092
H  -0.156914 1.827211 0.240161
H  -2.282912 2.489881 0.364822
H  -1.350034 -1.697276 -0.288005
H  -4.710689 1.970618 0.321187
H  -3.804344 -2.218938 -0.329108
H  -6.148551 -1.504443 0.279318
H  -6.523981 0.221915 0.543514
H  -6.320748 -0.405117 -1.110832
H  1.36958 2.819886 0.409811
H  5.404372 -0.088078 -0.133789
H  4.654336 1.541217 0.153352
H  1.017752 -3.683966 -0.700899
H  2.789395 -3.789119 -0.73825
