program: Gaussian 09
title: 000266203
version: EM64L-G09RevD.01
frameworkgroup: C1[X(C17H14Br2N6)]
method: RPBEPBE
basis: SDD
operation: Freq
keyword: #p
keyword: freq=noraman
keyword: PBEPBE/SDD
title: #p freq=noraman PBEPBE/SDD
converged: YES YES NO NO
title: Mulliken charges:
elementType: Br Br N N N N N N C C C C C C C C C C C C C C C C C H H H H H H H H H H H H H H
charge: -0.006565 0.008606 -0.449582 -0.147728 -0.138673 -0.260510 -0.641456 -0.580160 0.165033 0.064882 0.409137 0.186498 -0.256909 -0.436127 -0.315660 -0.009435 -0.153218 -0.169636 0.312225 -0.237431 -0.351643 -0.383246 -0.170063 -0.157516 -0.235255 0.405201 0.189719 0.239780 0.311419 0.247229 0.242454 0.244500 0.251289 0.321553 0.337255 0.249158 0.251952 0.329773 0.333149
chargesum: 0.00000
title: Mulliken charges with hydrogens summed into heavy atoms:
elementType: Br Br N N N N N N C C C C C C C C C C C C C C C C C
charge: -0.006565 0.008606 -0.044381 -0.147728 -0.138673 -0.260510 0.017352 0.082762 0.165033 0.064882 0.409137 0.186498 -0.067189 -0.196347 -0.004241 -0.009435 0.094011 0.072818 0.312225 -0.237431 -0.107144 -0.131957 0.079095 0.094435 -0.235255
polarizability: 4.88991574e+02 3.97448235e+01 4.03952316e+02 2.82568559e+00 -1.54849168e+01 1.09186147e+02
1716.lowfreq: -3.9480 0.0006 0.0006 0.0007 1.0365 1.9812 19.2324 23.3153 29.3184
frequency: 19.2293 23.2833 29.3090 43.3149 45.1748 58.9866 71.7516 105.7153 126.7965 149.6983 165.9085 188.8287 198.1675 202.1633 214.9543 237.7725 280.0258 299.1554 305.7504 319.9661 344.4720 353.6174 376.8409 381.7172 410.3952 412.5057 424.5591 466.5019 482.3620 511.7362 515.5385 531.0619 540.6219 550.3403 554.0655 566.2534 621.0606 624.3632 639.0721 652.6126 667.5256 706.3736 709.0345 716.4059 717.3382 779.0710 797.1107 814.3509 818.3329 820.1654 827.6764 845.5129 856.1610 921.9974 940.9444 945.0767 947.8176 963.5837 987.2686 987.7811 989.2225 1031.5408 1045.2671 1057.8381 1059.9407 1103.1147 1108.5172 1122.9971 1130.8717 1172.9399 1182.8133 1191.8867 1254.6498 1282.2627 1288.6853 1296.7451 1335.4249 1349.5064 1359.7567 1375.3603 1399.1445 1400.5331 1408.2675 1442.2502 1464.4067 1473.4179 1486.3944 1514.8251 1541.1205 1560.7748 1568.1494 1570.4130 1593.8606 1601.5798 1608.3635 1626.9194 1682.3774 2772.2042 2981.8480 3130.5201 3135.8627 3148.2351 3159.5377 3166.7225 3170.6644 3173.0363 3195.8800 3551.2493 3558.0778 3706.4867 3717.5429
redmass: 16.7326 5.8318 5.0985 4.1940 4.6145 7.5385 7.0829 8.2915 8.3294 9.5482 8.2914 4.5986 7.1076 6.8472 6.7894 6.2184 5.2636 3.8356 4.0941 4.4722 6.5363 5.0900 2.5000 3.7808 2.7983 2.9659 2.0604 4.0940 1.2202 3.1916 2.8187 5.2705 1.1104 4.1770 1.1647 7.1858 7.0637 7.1152 6.3560 7.4514 7.7999 4.3856 3.6053 5.4620 5.7794 8.9683 5.2344 1.6562 1.4044 3.6718 1.6698 1.4266 3.7690 1.5962 2.2675 1.3588 1.3522 1.3612 1.3388 4.3716 4.8273 3.4607 1.1086 2.6099 2.4403 1.6550 1.3551 1.9885 2.3164 1.5450 1.1163 2.2170 3.1649 2.1542 1.2730 1.5835 6.2791 3.6547 4.0784 2.4083 3.9694 4.1236 4.0969 4.3657 2.4954 2.6715 3.9280 3.5560 5.7627 7.3687 4.5691 7.5190 3.8547 5.8223 1.6483 1.5785 1.4402 1.0944 1.0857 1.0899 1.0887 1.0889 1.0911 1.0956 1.0953 1.0970 1.0946 1.0457 1.0443 1.1034 1.1058
irintensity: 0.0702 0.0513 0.3139 0.0577 0.3172 0.0515 0.0899 0.8520 1.4005 1.4364 0.1403 6.5436 3.3033 3.2272 1.0748 5.5316 2.3816 0.8305 7.8474 1.7360 24.5633 4.1029 53.5461 21.2479 6.8138 1.1828 72.6532 12.9431 235.7331 34.9513 47.0132 6.6139 13.4230 5.3543 113.6458 2.7700 1.1625 1.1350 5.4373 18.7045 7.8428 0.1195 0.8049 0.7088 5.2570 37.4290 13.0810 8.3926 16.5137 32.8786 39.4185 59.0037 15.7899 26.4871 8.1014 0.1420 0.1604 1.6347 4.4470 56.3394 42.2812 11.9195 86.4794 53.3737 28.2068 15.6434 8.8998 9.6545 5.0109 38.1966 2.1863 31.4802 14.5909 19.0183 0.1496 6.7097 41.6684 45.8557 102.9968 122.7171 13.0457 7.2211 216.9557 65.6338 136.3693 442.9409 940.0640 104.3976 236.7980 168.8199 931.4739 112.8382 286.4677 96.9739 284.2721 246.4913 607.1719 533.9819 39.8785 11.3491 8.6113 7.2441 5.2442 8.2626 3.7488 2.8862 15.1327 93.8593 211.2156 31.4977 46.0824
temp: 298.150 k
press: 1.00000 atm
elementType: 35 35 7 7 7 7 7 7 6 6 6 6 6 6 6 6 6 6 6 6 6 6 6 6 6 1 1 1 1 1 1 1 1 1 1 1 1 1 1
symmnumber: 1
zpe: 748055.9 jmol-1
zpe.correction: 0.284919 hartree
zpe.thermalcorrener: 0.307437 hartree
zpe.thermalcorrenthalpy: 0.308381 hartree
zpe.thermalcorrgfe: 0.229190 hartree
zpe.sumelectzpe: -1009.943225 hartree
zpe.sumelectthermal: -1009.920708 hartree
zpe.sumelectthermalent: -1009.919763 hartree
zpe.sumelectthermalfe: -1009.998954 hartree
dipole: -1.2285 6.1263 0.1376
dipole: 6.2498
quadrupole: -169.8094 -137.0693 -169.5637
quadrupole: 5.5387 -0.1318 -3.9563
quadrupole: -10.9953 21.7448 -10.7496 5.5387 -0.1318 -3.9563
hfenergy: -1010.2281443 hartree
pointgroup: C01 [X(C17H14Br2N6)]
dipole: 0.2516108 -2.444454 -0.0851801 debye
polarizability: 493.4563988|33.3721127|395.0999896|-28.6910355|27.301503|113.5736483 unknown
InChI: InChI=1S/C17H14Br2N6/c18-10-1-5-12(6-2-10)22-9-14-15(20)24-17(21)25-16(14)23-13-7-3-11(19)4-8-13/h1-9,23H,20-21H2
charge 0 multiplicity 1
39 atoms
Br -4.937284 4.934456 0.5018
Br 7.14149 2.320026 -0.560714
N  -1.087994 0.080383 0.161114
N  -2.514147 -1.82581 0.022683
N  -1.531566 -4.070424 -0.119575
N  1.517648 -0.236042 0.06059
N  0.743013 -4.446966 -0.09221
N  -3.835793 -3.740322 -0.151834
C  -1.261672 -1.278264 0.05625
C  -0.053267 -2.099314 -0.023635
C  -2.030651 1.130833 0.233396
C  -0.281802 -3.525708 -0.077101
C  1.270214 -1.539667 -0.066957
C  -1.498792 2.452104 0.289521
C  -3.442378 0.956912 0.256465
C  -2.580758 -3.188654 -0.084171
C  -2.346182 3.573471 0.368563
C  -4.293431 2.079955 0.335563
C  2.820402 0.295728 -0.101586
C  -3.742735 3.37528 0.391671
C  3.783527 -0.242137 -1.004994
C  3.159912 1.46186 0.639234
C  5.056722 0.350029 -1.139762
C  4.431205 2.056782 0.515849
C  5.371533 1.49033 -0.371825
H  -0.053256 0.335846 0.176842
H  2.119351 -2.236802 -0.205958
H  -0.412842 2.60103 0.264621
H  -3.846019 -0.054732 0.209794
H  -1.924675 4.581827 0.409122
H  -5.378304 1.93911 0.353081
H  3.526669 -1.098595 -1.638541
H  2.419328 1.882621 1.327146
H  1.718196 -4.196147 0.0323
H  0.476689 -5.428786 -0.139393
H  5.784823 -0.061386 -1.845011
H  4.68406 2.946237 1.09995
H  -4.649537 -3.132085 -0.12522
H  -3.928094 -4.74998 -0.22457
