program: Gaussian 09
title: 000266202
version: EM64L-G09RevD.01
frameworkgroup: C1[X(C5H5ClN4O)]
method: RPBEPBE
basis: SDD
operation: Freq
keyword: #p
keyword: freq=noraman
keyword: PBEPBE/SDD
title: #p freq=noraman PBEPBE/SDD
converged: NO NO NO NO
title: Mulliken charges:
elementType: Cl O N N N N C C C C C H H H H H
charge: -0.020930 -0.280895 -0.098126 -0.005388 -0.617504 -0.572958 0.251964 0.183455 -0.289949 0.004996 -0.152328 0.200091 0.327949 0.383407 0.345748 0.340469
chargesum: 0.00000
title: Mulliken charges with hydrogens summed into heavy atoms:
elementType: Cl O N N N N C C C C C
charge: -0.020930 -0.280895 -0.098126 -0.005388 0.093852 0.113259 0.251964 0.183455 -0.289949 0.004996 0.047764
polarizability: 1.49050608e+02 -4.18721189e+00 1.19138916e+02 2.64395113e-03 -1.08762573e-02 3.75092733e+01
1716.lowfreq: -11.3687 -8.1121 0.0016 0.0017 0.0032 7.8811 77.2731 160.6100 199.9278
frequency: 77.2728 160.6088 199.9270 211.4479 226.2502 265.5270 319.1666 337.7156 368.5563 413.3682 491.9888 523.6648 553.8678 574.4889 589.9595 628.0986 630.8365 712.9295 760.2395 776.0889 853.7377 857.4519 944.5495 956.6589 1003.3935 1165.5809 1256.3679 1305.6292 1347.1133 1366.7728 1430.3966 1439.2018 1498.6889 1558.6419 1591.5036 1599.8611 1623.1871 2998.9303 3279.5486 3554.1520 3620.9284 3712.9911
redmass: 6.0785 6.8614 6.3061 12.8942 6.5134 5.3624 2.7062 3.4329 10.7972 7.2164 3.7103 1.2245 1.0811 7.8147 1.7730 2.4368 6.4294 8.6231 6.2146 6.3942 1.1619 6.9048 5.5942 1.7093 1.8325 2.0310 4.7518 3.9535 7.6982 1.6030 2.9209 3.4883 3.0303 3.8091 1.6408 5.1252 2.1644 1.0879 1.0628 1.0445 1.0903 1.1061
irintensity: 0.4577 1.9797 0.6153 1.5814 16.8179 1.7102 6.4899 25.1802 11.4234 3.4414 0.1670 275.6784 0.7031 5.4965 79.6543 107.2765 13.3022 0.1801 35.7635 7.0838 155.4027 61.8893 20.5224 4.9197 4.8723 6.2371 128.2812 42.2450 99.1951 40.1014 30.2513 285.4838 165.7431 103.6198 163.4962 1304.0590 231.0603 40.6371 125.8987 175.8348 79.5203 58.5637
temp: 298.150 k
press: 1.00000 atm
elementType: 17 8 7 7 7 7 6 6 6 6 6 1 1 1 1 1
symmnumber: 1
zpe: 285831.5 jmol-1
zpe.correction: 0.108867 hartree
zpe.thermalcorrener: 0.118486 hartree
zpe.thermalcorrenthalpy: 0.119431 hartree
zpe.thermalcorrgfe: 0.073776 hartree
zpe.sumelectzpe: -947.056843 hartree
zpe.sumelectthermal: -947.047224 hartree
zpe.sumelectthermalent: -947.046280 hartree
zpe.sumelectthermalfe: -947.091935 hartree
dipole: -3.9958 -1.8357 0.0050
dipole: 4.3973
quadrupole: -62.4993 -67.4435 -71.9977
quadrupole: 4.3640 0.0045 -0.0193
quadrupole: 4.8142 -0.1300 -4.6842 4.3640 0.0045 -0.0193
hfenergy: -947.1657102 hartree
pointgroup: C01 [X(C5H5Cl1N4O1)]
dipole: 1.4889079 0.8683133 0.1489263 debye
dipolederiv: -0.2104153 -0.2876931 -0.0256432 -0.2439266 -0.8412583 -0.0623765 -0.0228079 -0.0649578 -0.0931295 -1.1434745 0.1341107 -0.0394726 0.6417237 -0.6159929 0.0239032 -0.008012 -0.0076632 -0.3690795 -1.2674162 0.399158 -0.035341 0.3621169 -0.7478597 -0.0071951 -0.0376442 -0.005268 -0.2841053 -1.598852 -0.4566365 -0.1153767 -0.6118569 -0.8152666 -0.0771597 -0.1253523 -0.0672532 -0.2057796 -0.5593029 0.4278607 0.0310232 0.3881164 -1.0724461 -0.0045058 0.0286187 -0.0016243 -0.6244177 -1.7440412 -0.0182939 -0.0658212 -0.1694133 -0.2266353 0.0191924 -0.0751532 0.0285204 -0.6940185 -1.4083056 -0.0748033 -0.0910279 0.0018291 -0.9500072 -0.0590872 -0.0864029 -0.0637804 -0.0262117 1.1786788 -0.3943136 0.0343646 -0.1247217 1.2924356 0.0613243 0.0518723 0.0447368 0.2173584 1.6247681 0.4058378 0.1219461 -0.0807966 1.5308121 0.0873746 0.0912885 0.1174279 0.0713351 2.2341773 0.0053414 0.1237037 0.3156798 1.0332497 0.0703901 0.1432908 0.0511846 0.2430537 1.7368574 -0.1673452 0.0895009 -0.2866371 0.5549957 0.0098581 0.0824941 0.0172267 0.1337663 0.0581513 -0.0155602 -0.0047458 -0.1288229 -0.1177541 -0.0232016 -0.0119459 -0.0162334 0.1156788 0.1715693 -0.0443425 -0.0150758 -0.0528838 0.26409 -0.0101968 -0.0156237 -0.0099334 0.3701258 0.3347908 0.0769271 0.0032886 -0.0281473 0.3403518 -0.0031097 -0.0033459 0.0033236 0.3636578 0.3176962 -0.016226 -0.0056803 -0.1008232 0.1901516 -0.0190286 -0.0112325 -0.0137508 0.3900818 0.2751185 0.0259786 -0.0056425 0.1185635 0.1811337 -0.0061817 -0.0000439 -0.0119556 0.3916842 unknown
polarizability: 149.1600688|-1.5547255|118.2909697|6.8032398|5.0201184|38.2477587 unknown
InChI: InChI=1S/C5H5ClN4O/c6-3-2(1-11)4(7)10-5(8)9-3/h1H,7-8H2
charge 0 multiplicity 1
16 atoms
Cl -0.566814 -2.912514 -0.288587
O  -3.070644 0.76587 -0.212932
N  1.194355 1.327012 0.087689
N  1.41168 -1.113707 -0.053891
N  -0.919978 2.32523 0.021108
N  3.281115 0.269648 0.149149
C  -0.818597 -0.10854 -0.127923
C  -0.16567 1.195788 -0.004673
C  0.090091 -1.203234 -0.141052
C  1.920574 0.176269 0.05912
C  -2.263627 -0.230663 -0.225593
H  -2.664503 -1.260168 -0.317323
H  -0.451243 3.225847 0.107666
H  -1.946271 2.205857 -0.048556
H  3.835344 -0.58288 0.129429
H  3.713092 1.186086 0.234668
