program: Gaussian 09
title: 000266176
version: EM64L-G09RevD.01
frameworkgroup: C1[X(C12H10N2O5)]
method: RPBEPBE
basis: SDD
operation: Freq
keyword: #p
keyword: freq=noraman
keyword: PBEPBE/SDD
title: #p freq=noraman PBEPBE/SDD
converged: YES YES NO NO
title: Mulliken charges:
elementType: O O O O O N N C C C C C C C C C C C C H H H H H H H H H H
charge: -0.255359 -0.226493 -0.204617 -0.150674 -0.248060 0.089668 0.008215 0.527098 -0.226191 0.355255 -0.570355 0.346176 -0.310296 -0.497739 -0.043140 -0.282237 0.185183 -0.535829 -0.501495 0.267744 0.255642 0.289934 0.281129 0.254961 0.230521 0.233866 0.240904 0.243551 0.242635
chargesum: 0.00000
title: Mulliken charges with hydrogens summed into heavy atoms:
elementType: O O O O O N N C C C C C C C C C C C C
charge: -0.255359 -0.226493 -0.204617 -0.150674 -0.248060 0.089668 0.008215 0.527098 -0.226191 0.355255 -0.302611 0.346176 -0.054654 -0.207805 -0.043140 -0.001107 0.185183 0.183520 0.225595
polarizability: 2.86100902e+02 8.73833289e+00 1.83169558e+02 -7.12146934e+00 -3.20880930e+00 8.05701820e+01
1716.lowfreq: -4.6159 -0.0010 -0.0009 -0.0007 3.4325 6.5372 29.8476 45.1772 49.5649
frequency: 29.8364 45.1711 49.5641 84.9547 88.8484 101.6757 111.2588 142.5077 149.1026 180.7089 193.1773 201.0413 241.3356 263.4603 286.3055 332.1993 349.8433 363.6335 392.4892 415.9243 455.2611 499.1150 507.0679 534.0257 554.5329 628.1641 636.3522 643.8463 689.2909 707.2002 746.4298 751.1556 805.6529 810.8296 850.2642 873.2997 887.6700 899.7475 913.0700 926.1998 983.8683 1007.3064 1016.6420 1097.8889 1110.6282 1112.9157 1123.6404 1151.0835 1153.5893 1168.9186 1203.4456 1223.5804 1258.5835 1290.6395 1302.3895 1358.4053 1374.9683 1389.5493 1416.0021 1421.2110 1437.5272 1453.6700 1459.3699 1466.7836 1471.3295 1472.8131 1489.9239 1542.6503 1590.3175 1599.6160 1631.4870 2973.0068 3004.7133 3067.4402 3106.0374 3137.8945 3143.7737 3156.4788 3157.4072 3179.3769 3181.9588
redmass: 5.4591 4.7830 14.1874 4.1735 3.2854 1.2859 5.2652 4.0579 5.6138 3.4340 3.6120 3.0709 1.7225 5.4662 4.7947 6.8988 6.9794 6.0733 5.9250 5.4762 5.3843 6.2365 5.7258 5.5855 5.1909 6.1825 4.4050 4.7241 7.4942 10.7240 6.4289 4.6085 5.5039 4.9820 1.5522 7.7519 1.6455 7.3113 1.7584 7.6941 5.9880 1.3494 3.3678 4.0655 1.2561 1.2642 1.6836 1.5204 1.3818 1.5628 2.3820 3.2421 3.1468 3.0657 7.3827 4.4787 4.7804 5.1088 5.7362 1.2414 1.3128 1.0500 1.0672 1.7468 1.0986 1.3193 5.1483 7.5038 6.9307 9.1656 7.3091 1.0326 1.0298 1.1049 1.1045 1.1003 1.0907 1.1045 1.0924 1.0916 1.0965
irintensity: 3.8346 0.0138 1.5624 1.4330 2.5327 2.5963 1.0255 10.1330 2.9250 2.5639 1.6441 0.9696 0.4779 1.4930 22.8453 3.4861 1.5357 3.2871 1.7222 0.4073 2.3483 1.6564 2.0407 14.9377 11.9646 6.8388 4.0079 3.5647 4.1279 28.2102 1.5530 22.4859 6.2366 10.5254 5.6362 6.6939 11.7563 4.5029 59.6951 3.1756 25.6037 0.0482 35.7565 216.0940 0.0761 0.0453 26.9969 78.2530 0.0557 79.7873 69.1509 155.5814 472.5756 2.3903 22.0608 1.3560 67.4147 62.0818 1.1716 13.2378 35.9942 14.9912 14.1844 111.1590 15.2246 3.5634 61.6604 56.0564 23.7761 208.8563 136.9203 63.4178 37.2971 36.0027 25.4292 18.8241 6.1938 11.3738 3.2969 0.8080 3.0602
temp: 298.150 k
press: 1.00000 atm
elementType: 8 8 8 8 8 7 7 6 6 6 6 6 6 6 6 6 6 6 6 1 1 1 1 1 1 1 1 1 1
symmnumber: 1
zpe: 539701.5 jmol-1
zpe.correction: 0.205561 hartree
zpe.thermalcorrener: 0.222887 hartree
zpe.thermalcorrenthalpy: 0.223831 hartree
zpe.thermalcorrgfe: 0.158996 hartree
zpe.sumelectzpe: -947.433514 hartree
zpe.sumelectthermal: -947.416188 hartree
zpe.sumelectthermalent: -947.415244 hartree
zpe.sumelectthermalfe: -947.480079 hartree
dipole: 3.9017 -3.1584 -0.2137
dipole: 5.0243
quadrupole: -80.0563 -115.8265 -110.9157
quadrupole: -6.1855 2.3864 0.0976
quadrupole: 22.2099 -13.5603 -8.6495 -6.1855 2.3864 0.0976
hfenergy: -947.6390752 hartree
pointgroup: C01 [X(C12H10N2O5)]
dipole: 1.5197448 1.2598279 0.1031859 debye
polarizability: 286.2689203|-7.5826429|183.037133|7.4558037|-1.8207265|80.5345888 unknown
InChI: InChI=1S/C12H10N2O5/c1-18-8-5-7-3-4-9(12(15)19-2)13-11(7)10(6-8)14(16)17/h3-6H,1-2H3
charge 0 multiplicity 1
29 atoms
O  4.371185 1.076929 0.047401
O  -3.725398 -0.976564 0.115603
O  1.506204 -3.215251 0.609236
O  0.007206 -2.752804 -1.052888
O  -4.373983 1.255802 -0.021085
N  -1.100214 -0.289814 -0.043444
N  0.878285 -2.40133 -0.179412
C  0.698819 1.432482 -0.06649
C  0.232703 0.054842 -0.082898
C  1.24399 -0.9653 -0.089231
C  2.088784 1.725922 -0.036735
C  3.034098 0.689299 -0.000172
C  -0.309455 2.456834 -0.070537
C  2.605857 -0.674916 -0.01774
C  -2.005722 0.707278 -0.031392
C  -1.653471 2.101647 -0.065276
C  -3.473388 0.376681 0.018819
C  5.401018 0.028684 0.104796
C  -5.159298 -1.354622 0.155797
H  2.440527 2.762573 -0.032448
H  -0.004963 3.509011 -0.070514
H  3.316738 -1.504124 0.017567
H  -2.457704 2.841668 -0.070896
H  6.35425 0.573821 0.148038
H  5.375497 -0.607009 -0.800283
H  5.285856 -0.595529 1.010698
H  -5.649892 -0.899481 1.032826
H  -5.151592 -2.450549 0.225523
H  -5.668633 -1.014777 -0.761662
