program: Gaussian 09
title: 000266177
version: EM64L-G09RevD.01
frameworkgroup: C1[X(C17H18N2O2)]
method: RPBEPBE
basis: SDD
operation: Freq
keyword: #p
keyword: freq=noraman
keyword: PBEPBE/SDD
title: #p freq=noraman PBEPBE/SDD
converged: YES YES NO NO
title: Mulliken charges:
elementType: O O N N C C C C C C C C C C C C C C C C C H H H H H H H H H H H H H H H H H H
charge: -0.182402 -0.270466 -0.137734 -0.593080 -0.447036 -0.617194 0.243529 0.436753 0.457333 0.203918 -0.660026 -0.438445 -0.404342 -0.374681 -0.346664 -0.222731 -0.236207 -0.239633 -0.228030 -0.239592 -0.270232 0.251578 0.256933 0.314726 0.240113 0.224819 0.244207 0.235270 0.302252 0.234676 0.216040 0.230827 0.232708 0.233370 0.216591 0.215935 0.335253 0.358469 0.223194
chargesum: 0.00000
title: Mulliken charges with hydrogens summed into heavy atoms:
elementType: O O N N C C C C C C C C C C C C C C C C C
charge: -0.182402 -0.270466 -0.137734 0.100643 -0.195457 -0.045535 0.243529 0.436753 0.457333 0.203918 0.049113 -0.203175 -0.102090 -0.140005 -0.130624 0.008096 -0.003498 -0.006264 -0.011439 -0.023657 -0.047038
polarizability: 2.45363694e+02 8.05277996e+00 2.13590112e+02 1.13229567e+01 1.85098299e+00 1.51049607e+02
1716.lowfreq: -7.3173 -5.4475 -0.0001 0.0007 0.0008 1.6583 17.2909 19.8634 31.3244
frequency: 16.5649 19.6398 31.2547 41.7380 56.4911 58.8233 86.4998 101.5016 126.6335 138.5494 159.0148 197.7233 220.1122 257.9656 271.1261 304.5906 333.3111 350.9530 387.7567 405.7241 413.2699 465.6223 473.1804 498.9839 511.9141 521.5958 542.2141 589.1018 591.5171 614.1381 614.9686 625.9462 672.1797 689.5379 707.6919 721.5500 753.7231 755.3372 763.1223 808.9822 829.6246 846.1240 859.7850 866.9647 873.0361 929.8379 947.8769 953.8775 973.1176 976.3226 981.6679 988.2491 998.8446 1001.5082 1025.0750 1030.8878 1038.7502 1066.3564 1084.6944 1094.5404 1111.3306 1116.8167 1171.6729 1174.1986 1193.6476 1200.7837 1203.1993 1205.6748 1226.5927 1276.3038 1281.2139 1326.9214 1336.6350 1337.7523 1346.7465 1368.7476 1381.2242 1384.7790 1433.2587 1442.9028 1450.9570 1462.7495 1474.0380 1481.6112 1494.0938 1508.7881 1573.9241 1579.1262 1587.5986 1609.0142 1622.2602 1636.9280 1650.7798 2950.0199 2954.6214 3004.1341 3013.7190 3020.8900 3096.0640 3117.6810 3120.8422 3127.7630 3130.8800 3144.0979 3150.6311 3159.6793 3159.9163 3170.3227 3170.6215 3501.6174 3656.2809
redmass: 5.3720 4.3262 3.5745 6.8226 4.4208 5.4338 3.8783 4.0655 7.3216 4.8251 1.6903 2.0266 5.0777 3.6563 3.6905 5.0656 5.6082 6.3877 3.4593 2.8563 2.9682 3.5441 2.2285 3.5655 2.7681 2.5426 3.3577 1.4727 1.5721 5.5656 6.3043 4.8153 2.4421 1.8179 1.9107 4.2547 1.9093 2.0580 4.5979 1.2639 3.9684 3.8416 1.2703 1.5225 4.4780 1.6800 2.6070 1.3851 1.3772 4.2278 1.5399 3.7479 2.8570 1.4527 2.8081 2.1119 2.2054 1.9356 1.6292 1.6323 1.2961 1.7101 1.0524 1.0600 1.1151 1.1514 2.0595 1.3206 1.6600 1.8053 1.8435 1.3871 2.5892 1.4905 1.4667 2.4715 6.0332 6.7265 1.1958 2.1114 1.9493 1.2705 1.0547 2.2556 1.3024 1.8143 1.5288 5.9922 5.7776 5.8938 5.9986 3.3895 8.2416 1.0443 1.0534 1.0978 1.0834 1.1015 1.0968 1.0878 1.0843 1.0887 1.0870 1.0929 1.0921 1.0947 1.0962 1.0992 1.0987 1.0453 1.1043
irintensity: 0.3959 1.8765 1.3733 4.3238 4.6297 4.2861 0.9186 3.1363 3.0028 2.3400 0.4718 1.7159 2.3695 6.1782 0.7049 1.2491 7.2384 10.8223 2.6142 0.3057 0.0854 14.7289 3.1242 11.2051 12.3002 16.8307 20.0742 53.4156 118.0048 1.0819 0.9854 17.7066 51.3136 42.3283 50.9755 10.9987 73.9801 17.6209 14.7084 0.4939 7.5142 15.9645 1.6605 6.9321 4.2578 6.7303 48.4023 2.3295 2.4386 6.1865 1.2900 9.1941 35.5894 2.6937 37.8003 31.0134 11.6247 6.6101 9.2304 3.2781 1.5418 33.3891 0.2549 0.1477 0.8990 0.7236 3.1427 155.5830 32.2471 12.6311 50.6453 25.8878 146.6714 10.5321 10.4572 92.1125 4.8985 9.1211 17.6744 9.6697 2.7642 15.4202 8.6506 37.0066 7.2782 200.4392 126.1876 12.6159 6.6087 30.2260 194.2075 283.0735 64.2557 78.6554 15.9377 13.0569 8.2084 38.6407 15.5371 7.0485 8.6483 10.9079 1.1132 25.2656 49.7468 38.1934 14.2795 16.8954 4.7994 47.8577 76.9704
temp: 298.150 k
press: 1.00000 atm
elementType: 8 8 7 7 6 6 6 6 6 6 6 6 6 6 6 6 6 6 6 6 6 1 1 1 1 1 1 1 1 1 1 1 1 1 1 1 1 1 1
symmnumber: 1
zpe: 822849.8 jmol-1
zpe.correction: 0.313407 hartree
zpe.thermalcorrener: 0.333100 hartree
zpe.thermalcorrenthalpy: 0.334044 hartree
zpe.thermalcorrgfe: 0.261851 hartree
zpe.sumelectzpe: -917.049844 hartree
zpe.sumelectthermal: -917.030151 hartree
zpe.sumelectthermalent: -917.029207 hartree
zpe.sumelectthermalfe: -917.101399 hartree
dipole: -4.4605 -0.1192 -0.2493
dipole: 4.4691
quadrupole: -108.0426 -122.2721 -122.0132
quadrupole: 6.4481 -0.9524 7.3012
quadrupole: 9.4000 -4.8295 -4.5706 6.4481 -0.9524 7.3012
hfenergy: -917.3632506 hartree
pointgroup: C01 [X(C17H18N2O2)]
dipole: -1.7283627 0.0801245 0.3128305 debye
polarizability: 240.922864|-9.0872975|213.9216334|-22.2147407|0.3869956|155.1589155 unknown
InChI: InChI=1S/C17H18N2O2/c1-19(14-10-6-3-7-11-14)12-15(20)16(17(18)21)13-8-4-2-5-9-13/h2-11,16H,12,18H2,1H3
charge 0 multiplicity 1
39 atoms
O  -0.127951 -0.443489 -1.219749
O  -1.389265 -3.176614 1.05746
N  2.308005 -1.269898 0.052032
N  -3.260996 -2.280145 0.010348
C  -1.48155 -0.727969 0.832743
C  1.080564 -1.137466 0.811623
C  -0.158658 -0.703212 0.004611
C  -2.448635 0.413257 0.551188
C  3.144915 -0.163655 -0.187087
C  -2.049238 -2.174504 0.644824
C  2.547016 -2.541154 -0.646986
C  -3.042729 1.094033 1.647141
C  -2.797233 0.81019 -0.769471
C  4.36768 -0.323564 -0.910346
C  2.822956 1.14536 0.291371
C  -3.965049 2.142413 1.436047
C  -3.71868 1.861808 -0.978176
C  -4.308917 2.528867 0.119748
C  5.230543 0.77058 -1.122046
C  3.699187 2.227584 0.075573
C  4.913666 2.056752 -0.628325
H  -1.192066 -0.701391 1.90066
H  1.206041 -0.437928 1.662959
H  0.797519 -2.109887 1.268471
H  1.741565 -3.250306 -0.396758
H  3.509755 -2.998576 -0.343513
H  2.553626 -2.405875 -1.746708
H  -2.780315 0.800756 2.671413
H  -2.312601 0.324122 -1.621339
H  4.648566 -1.303392 -1.306415
H  1.877072 1.336836 0.807141
H  -4.411221 2.656657 2.294472
H  -3.969107 2.164054 -2.001234
H  -5.022413 3.343308 -0.047202
H  6.161234 0.612248 -1.679862
H  3.419794 3.218847 0.452063
H  -3.648315 -3.209644 -0.150067
H  -3.770736 -1.45228 -0.298988
H  5.587068 2.903478 -0.796318
