program: Gaussian 09
title: 000266171
version: EM64L-G09RevD.01
frameworkgroup: C1[X(C13H23N)]
method: RPBEPBE
basis: SDD
operation: Freq
keyword: #pfreq=noraman
keyword: PBEPBE/SDD
title: #p freq=noraman PBEPBE/SDD
converged: YES YES NO NO
title: Mulliken charges:
elementType: N C C C C C C C C C C C C C H H H H H H H H H H H H H H H H H H H H H H H
charge: -0.029435 -0.021355 0.437244 -0.478885 -0.482349 -0.416803 -0.414502 -0.477586 -0.450456 -0.380520 -0.533391 -0.740124 -0.733177 -0.186610 0.189591 0.199932 0.214742 0.218146 0.189831 0.200107 0.193894 0.193453 0.200695 0.240710 0.209633 0.198284 0.203193 0.201419 0.189423 0.257055 0.253008 0.220543 0.226775 0.222434 0.249153 0.213525 0.222406
chargesum: 0.00000
title: Mulliken charges with hydrogens summed into heavy atoms:
elementType: N C C C C C C C C C C C C C
charge: -0.029435 0.168236 0.437244 -0.064211 -0.074373 -0.022801 -0.020355 -0.027243 -0.048979 0.010321 -0.023328 -0.070372 -0.048093 -0.186610
polarizability: 1.67428597e+02 2.05524138e+00 1.26279093e+02 3.00621541e+00 -6.16484059e-01 1.24747361e+02
1716.lowfreq: -18.7811 0.0001 0.0004 0.0006 5.1263 13.6186 50.1920 62.0629 83.3448
frequency: 49.8220 61.9730 83.2375 103.5191 132.2748 144.5998 163.0649 207.0301 212.6510 219.8941 233.5162 247.8811 303.3487 317.8028 330.9517 347.7237 371.1307 380.6416 428.1323 432.1913 444.4876 475.6773 533.4519 626.5720 697.2860 753.4067 783.8824 789.3415 801.6459 841.0780 848.2118 883.1949 891.7599 919.1330 926.7229 956.1758 961.2745 982.5227 1019.9694 1028.5296 1043.5599 1054.1338 1055.3965 1068.5634 1081.0889 1112.1997 1124.3152 1138.6779 1157.0801 1168.1449 1191.8258 1240.6557 1245.3485 1262.9369 1266.4327 1280.8648 1289.1622 1294.9259 1304.8802 1313.6078 1330.9029 1336.1748 1337.3447 1340.7836 1345.4519 1348.9327 1364.9783 1394.3845 1400.4717 1439.4376 1459.2960 1460.1611 1462.2455 1466.7282 1470.2380 1474.9629 1476.9020 1484.1660 1487.1955 1489.7855 1501.2118 2188.0938 2940.2251 2956.4949 2963.2618 2964.3521 2965.0594 2967.9150 2969.9176 2983.0653 2986.0285 2986.7463 2988.9045 3019.0639 3026.3729 3026.6625 3030.4763 3036.3912 3041.2934 3044.7663 3047.0945 3071.4440 3073.5591 3077.5814 3093.7449
redmass: 2.8635 2.8698 3.4242 2.6487 3.5360 3.1216 2.3064 2.0543 1.5236 1.1795 3.0140 2.0535 2.4813 2.5701 1.8840 2.3383 2.7452 3.7270 2.8583 2.9831 2.7837 1.6163 2.7979 2.7169 3.0099 1.4360 1.4782 1.4012 1.6879 2.1204 1.7783 1.9868 1.4267 2.1019 2.7386 1.5564 2.4595 2.6708 2.0039 1.7455 1.9267 1.9789 1.9672 1.2440 1.7879 2.5216 2.0927 1.6224 2.3776 2.5355 1.4618 1.3163 1.3952 1.2825 1.3022 1.1537 1.3314 1.3042 1.2754 1.2189 1.3498 1.4531 1.4213 1.4450 1.4207 1.4533 1.4251 1.2096 1.2003 1.0861 1.0857 1.0879 1.0848 1.0813 1.0687 1.0847 1.0520 1.0591 1.0507 1.0484 1.0702 12.4209 1.0796 1.0670 1.0620 1.0614 1.0658 1.0637 1.0599 1.0364 1.0568 1.0461 1.0547 1.0998 1.0985 1.0953 1.0980 1.0996 1.0959 1.0991 1.0989 1.0986 1.0986 1.0995 1.0994
irintensity: 3.8994 0.3383 1.7984 1.5044 2.5853 0.8294 0.0197 0.1784 0.0822 0.1410 0.3798 0.6213 0.3774 0.2241 0.0846 0.3566 0.1353 0.0701 0.3174 0.1119 0.7645 1.0490 2.7020 2.0077 0.7639 9.1281 0.2331 4.9626 4.3567 3.6227 3.2894 0.9649 11.7719 0.8928 8.2676 8.6394 2.8941 0.8334 8.3775 1.6200 1.9086 0.6411 0.6623 0.6568 0.6999 0.0299 0.4918 0.4581 1.8417 2.0333 0.0365 1.1830 0.1909 1.6555 1.6623 1.1007 12.3780 0.6297 4.6720 2.0592 0.3081 1.7902 1.0488 2.4800 4.4596 0.5828 3.7790 11.4361 20.2729 8.3347 4.8176 10.5642 5.4596 17.6240 6.1518 0.0399 13.4918 14.1011 7.8691 5.1486 5.1473 19.3573 4.7016 17.6516 22.0403 26.6076 30.2413 54.5145 46.2138 40.1749 13.1517 35.4111 12.9942 24.4025 63.6317 85.5917 9.5968 41.9846 38.2256 11.9148 82.5615 48.1552 53.4896 39.1388 30.7627
temp: 298.150 k
press: 1.00000 atm
elementType: 7 6 6 6 6 6 6 6 6 6 6 6 6 6 1 1 1 1 1 1 1 1 1 1 1 1 1 1 1 1 1 1 1 1 1 1 1
symmnumber: 1
zpe: 872973.5 jmol-1
zpe.correction: 0.332498 hartree
zpe.thermalcorrener: 0.348204 hartree
zpe.thermalcorrenthalpy: 0.349148 hartree
zpe.thermalcorrgfe: 0.290578 hartree
zpe.sumelectzpe: -562.790168 hartree
zpe.sumelectthermal: -562.774463 hartree
zpe.sumelectthermalent: -562.773518 hartree
zpe.sumelectthermalfe: -562.832088 hartree
dipole: 4.1226 1.1027 1.4927
dipole: 4.5211
quadrupole: -106.6471 -88.9926 -89.9556
quadrupole: -7.7328 -7.8644 -2.6525
quadrupole: -11.4487 6.2059 5.2428 -7.7328 -7.8644 -2.6525
hfenergy: -563.1226662 hartree
pointgroup: C01 [X(C13H23N1)]
dipole: 1.6468702 0.3209567 0.5905196 debye
polarizability: 167.5846735|-0.1166719|126.258547|2.5538168|-0.6739272|124.6118308 unknown
InChI: InChI=1S/C13H23N/c1-3-13(4-2,10-11-14)12-8-6-5-7-9-12/h12H,3-10H2,1-2H3
charge 0 multiplicity 1
37 atoms
N  -3.670887 -1.27358 -1.437771
C  0.890743 0.189038 0.213308
C  -0.69462 0.171734 0.134372
C  1.509128 -1.072949 0.883305
C  1.611853 0.447047 -1.140537
C  3.037535 -0.925354 1.082433
C  3.143165 0.59349 -0.954025
C  -1.229636 1.422305 -0.634992
C  -1.256816 0.134589 1.600321
C  3.755787 -0.641648 -0.256044
C  -1.127537 -1.123326 -0.651884
C  -0.816865 2.792569 -0.054532
C  -2.770049 0.385004 1.794309
C  -2.538029 -1.19312 -1.068827
H  1.140381 1.049083 0.873971
H  1.326313 -1.964361 0.247615
H  1.032336 -1.270527 1.860982
H  1.219024 1.360459 -1.623306
H  1.42177 -0.39323 -1.841534
H  3.445866 -1.841886 1.551108
H  3.234412 -0.090409 1.786658
H  3.347752 1.496101 -0.340976
H  3.626017 0.759363 -1.936749
H  -2.334086 1.366286 -0.663844
H  -0.907031 1.364142 -1.69335
H  -1.009953 -0.848047 2.047651
H  -0.697116 0.884643 2.195654
H  4.839533 -0.489727 -0.087377
H  3.655664 -1.525314 -0.920355
H  -0.91093 -2.01958 -0.040387
H  -0.516991 -1.206407 -1.57208
H  -1.280286 3.608788 -0.638399
H  -1.144985 2.908807 0.994408
H  0.277064 2.946222 -0.083266
H  -3.39208 -0.334538 1.235471
H  -3.028385 0.286321 2.865209
H  -3.066762 1.40051 1.476956
