program: Gaussian 09
title: 000266165
version: EM64L-G09RevD.01
frameworkgroup: C1[X(C9H16N2)]
method: RPBEPBE
basis: SDD
operation: Freq
keyword: #pfreq=noraman
keyword: PBEPBE/SDD
title: #p freq=noraman PBEPBE/SDD
converged: YES YES NO NO
title: Mulliken charges:
elementType: N N C C C C C C C C C H H H H H H H H H H H H H H H H
charge: -0.179710 -0.060734 0.308229 -0.469874 0.184931 -0.350004 -0.517944 -0.460893 -0.684216 -0.627289 -0.675122 0.218727 0.206285 0.200008 0.215415 0.200907 0.213525 0.259724 0.212910 0.208769 0.224963 0.265197 0.224951 0.231190 0.223059 0.213694 0.213305
chargesum: 0.00000
title: Mulliken charges with hydrogens summed into heavy atoms:
elementType: N N C C C C C C C C C
charge: -0.179710 -0.060734 0.308229 -0.044862 0.184931 0.065418 -0.103513 -0.201169 -0.037575 0.094048 -0.025065
polarizability: 1.25852655e+02 -1.69034590e+00 1.18471560e+02 -8.41417268e+00 9.12157721e-01 8.07787622e+01
1716.lowfreq: -39.6462 -8.5629 0.0004 0.0005 0.0007 6.6405 14.8709 44.1177 51.3661
frequency: -37.5875 43.8170 51.2677 78.8164 96.5550 123.4581 194.1399 206.2967 230.3896 264.1771 265.6182 301.7188 348.3809 413.6865 462.1173 586.0247 632.6409 681.2809 720.1372 745.1555 750.9204 782.3564 840.2252 856.9603 886.2519 942.7256 964.1729 1017.5472 1037.9572 1050.0851 1063.4804 1092.0691 1118.8086 1135.6557 1174.8953 1194.4827 1230.7728 1248.9516 1271.0218 1283.0791 1289.3490 1308.1419 1334.7372 1339.5557 1383.4837 1390.4105 1392.1152 1433.5101 1460.3903 1468.0681 1470.1560 1471.4839 1475.0733 1477.7934 1478.5546 1485.9607 1486.5434 1490.5519 1566.5320 2972.6675 2974.6278 2975.2236 2979.9082 2983.7892 2985.3348 3019.8354 3027.3117 3043.8730 3065.2728 3071.6509 3072.7573 3075.1499 3081.9476 3129.5988 3210.1913
redmass: 2.3048 1.3999 1.8240 1.6503 2.9221 3.4836 1.4003 3.0357 1.1574 1.5728 2.1838 2.9578 3.3603 4.7360 2.6915 3.8356 6.3234 3.7051 1.5545 1.7060 3.4339 1.3738 1.3611 1.4214 1.9688 2.6950 2.1381 1.8552 1.4364 2.8821 1.9978 2.1133 1.3140 2.1110 1.6083 2.2745 1.3737 1.5695 1.7985 1.2833 1.4306 1.6614 2.9419 1.5365 1.2582 1.2155 2.6232 1.5488 1.1263 1.5564 1.0572 1.0801 1.0617 1.1043 1.0478 1.1082 1.2645 1.2869 7.1025 1.0453 1.0502 1.0366 1.0587 1.0471 1.0523 1.0973 1.1007 1.1018 1.1004 1.1013 1.1001 1.0991 1.1009 1.0981 1.0973
irintensity: 0.1352 0.1033 0.3257 0.0667 1.8455 0.5709 0.4275 2.7877 0.1023 0.0387 1.7235 1.6793 2.2620 1.5554 1.6679 1.2812 3.1350 6.9465 10.0190 0.6180 2.3021 2.5172 23.3802 7.8712 6.4321 23.7244 0.3608 2.1010 0.7831 0.2316 8.6611 10.2247 1.6152 1.7571 6.7399 2.2318 0.9494 0.2240 4.7779 0.1506 6.0226 0.2856 3.3627 0.8748 10.1859 12.8837 24.1162 19.8299 6.9169 0.8235 4.6667 12.0520 8.1949 6.1743 9.0340 32.7231 21.9002 7.1747 2.7882 16.2195 28.5603 45.0170 40.2916 31.1309 67.2006 1.6484 14.7542 13.8725 27.8002 72.8737 66.2525 46.1944 44.3617 4.9756 5.8065
temp: 298.150 k
press: 1.00000 atm
elementType: 7 7 6 6 6 6 6 6 6 6 6 1 1 1 1 1 1 1 1 1 1 1 1 1 1 1 1
symmnumber: 1
zpe: 617629.9 jmol-1
zpe.correction: 0.235243 hartree
zpe.thermalcorrener: 0.247361 hartree
zpe.thermalcorrenthalpy: 0.248305 hartree
zpe.thermalcorrgfe: 0.196206 hartree
zpe.sumelectzpe: -461.175398 hartree
zpe.sumelectthermal: -461.163280 hartree
zpe.sumelectthermalent: -461.162335 hartree
zpe.sumelectthermalfe: -461.214435 hartree
dipole: -2.5402 -1.4728 0.8139
dipole: 3.0470
quadrupole: -66.2648 -69.0746 -69.3312
quadrupole: -7.0359 -1.6134 2.8811
quadrupole: 1.9587 -0.8510 -1.1077 -7.0359 -1.6134 2.8811
hfenergy: -461.4106408 hartree
pointgroup: C01 [X(C9H16N2)]
dipole: 1.0736958 0.44253 0.29738 debye
polarizability: 125.577557|-2.609672|119.029811|7.3599454|-2.1522927|80.4956092 unknown
InChI: InChI=1S/C9H16N2/c1-4-6-9-8(5-2)7-10-11(9)3/h7H,4-6H2,1-3H3
charge 0 multiplicity 1
27 atoms
N  -0.251883 -1.545533 0.156037
N  -1.554869 -1.802417 -0.273357
C  0.048983 -0.186281 0.169664
C  1.400821 0.355386 0.556028
C  -1.11181 0.481589 -0.281595
C  2.41699 0.399859 -0.622667
C  -1.315982 1.973005 -0.418026
C  -2.06007 -0.558236 -0.535205
C  3.787331 0.965279 -0.195111
C  0.587816 -2.668574 0.569599
C  -1.964674 2.616573 0.837657
H  1.2729 1.381238 0.950997
H  1.836285 -0.241688 1.382596
H  2.543425 -0.619342 -1.038756
H  1.989053 1.014256 -1.438245
H  -0.347319 2.47082 -0.619671
H  -1.956297 2.179256 -1.297364
H  -3.082973 -0.468301 -0.899572
H  3.68778 1.994729 0.197859
H  4.245411 0.346235 0.599564
H  4.491147 0.996154 -1.04656
H  0.052415 -3.590401 0.299535
H  1.562932 -2.649076 0.051788
H  0.76313 -2.662808 1.661495
H  -2.948741 2.15981 1.046333
H  -2.110132 3.704144 0.697843
H  -1.330971 2.464123 1.730635
