program: Gaussian 09
title: 000266167
version: EM64L-G09RevD.01
frameworkgroup: C1[X(C15H14N2O2)]
method: RPBEPBE
basis: SDD
operation: Freq
keyword: #p
keyword: freq=noraman
keyword: PBEPBE/SDD
title: #p freq=noraman PBEPBE/SDD
converged: YES YES NO NO
title: Mulliken charges:
elementType: O O N N C C C C C C C C C C C C C C C H H H H H H H H H H H H H H
charge: -0.260262 -0.230379 -0.420126 0.065516 0.265642 -0.360711 -0.329292 0.335879 -0.344705 -0.364378 0.172246 0.441261 -0.381524 -0.364201 -0.380177 -0.224725 -0.219574 -0.234295 -0.537312 0.272438 0.220113 0.246459 0.254464 0.221149 0.282444 0.284658 0.201551 0.227437 0.229804 0.229950 0.226756 0.225373 0.248520
chargesum: 0.00000
title: Mulliken charges with hydrogens summed into heavy atoms:
elementType: O O N N C C C C C C C C C C C C C C C
charge: -0.260262 -0.230379 -0.135469 0.065516 0.265642 -0.088273 -0.109179 0.335879 -0.098247 -0.109914 0.172246 0.441261 -0.160375 -0.081757 -0.178625 0.002712 0.010231 -0.004344 0.163337
polarizability: 4.16640394e+02 -7.48735455e+00 1.76492630e+02 -3.41993624e+00 -6.55897283e-01 8.11162437e+01
1716.lowfreq: -6.8200 -2.7844 -0.0008 -0.0006 0.0006 3.3639 23.5745 27.9769 38.4184
frequency: 23.5720 27.9320 38.3962 64.6315 82.2912 107.2662 125.4273 162.1880 179.3423 215.0976 228.7738 239.6040 282.2581 294.0023 335.2661 338.5204 404.3151 414.8843 425.5284 475.3746 488.0769 513.3527 524.1795 591.3521 614.5511 618.8044 632.8729 643.0872 679.3601 699.2870 752.8583 767.8699 771.6736 820.4430 824.5946 842.7441 854.8744 897.1197 917.4908 948.2872 953.0308 977.5226 983.6107 984.2996 987.2453 998.8879 1005.9538 1022.7441 1028.0066 1083.3054 1112.5267 1115.1858 1127.8518 1157.5447 1172.7667 1175.1017 1184.1054 1235.4784 1239.4776 1244.8062 1302.0976 1315.8986 1341.5753 1372.6021 1389.2753 1423.7658 1436.8671 1438.1420 1468.3571 1471.1201 1478.8805 1494.7899 1509.0180 1566.9726 1570.8204 1594.2695 1612.2156 1614.5543 1624.1924 2955.5159 2966.5942 3057.5729 3114.2714 3120.8887 3129.8322 3130.8395 3142.9327 3150.7557 3157.9145 3168.6581 3168.9674 3171.6530 3384.8856
redmass: 5.0619 3.9051 4.8406 4.9922 4.4759 5.4324 4.6572 5.2126 4.3594 1.7374 2.0103 3.6348 3.8090 4.5908 5.4415 7.1158 2.8353 3.0010 5.4999 6.1395 3.7026 3.0290 3.1890 6.1427 6.4312 2.0762 2.3323 4.8630 4.4199 1.7653 4.2991 6.0116 1.7603 1.7287 2.4499 1.8104 1.2534 5.3890 1.3807 1.5794 1.3807 1.3706 8.3124 1.3722 6.2702 2.9734 1.3362 2.2585 4.2536 1.6250 1.2596 1.4298 3.2871 1.3373 1.0576 1.2544 1.1136 2.0201 2.8184 3.0316 1.2924 1.5487 1.4889 5.1729 6.3547 4.2076 1.3027 1.9579 1.0517 1.0747 2.0217 2.3122 2.1574 6.6244 6.8428 5.8343 5.9647 6.7850 7.2555 1.0864 1.0327 1.1043 1.0876 1.0895 1.0868 1.0999 1.0921 1.0878 1.0961 1.0948 1.1004 1.0960 1.0749
irintensity: 0.3890 1.6024 0.3827 3.4745 1.8895 6.3765 11.7901 2.3617 4.9372 9.9224 4.9288 7.4365 2.0288 2.7383 4.0459 1.9407 0.1003 0.0295 9.7321 14.4756 2.9587 9.0389 7.1678 33.6312 0.3368 47.1354 30.9690 19.2665 23.3674 57.2327 16.2249 2.5081 43.4324 5.1866 7.6922 59.2608 0.7551 39.9054 6.5528 35.0784 0.8327 3.5882 53.7868 0.1189 0.1619 7.4815 1.5304 17.4561 4.9066 18.0179 0.2437 98.6581 213.9687 0.7195 0.7910 279.1237 1.0497 3.6862 120.9294 577.5502 1.2863 7.2480 13.2671 9.6498 4.1649 9.1997 21.7641 3.5989 19.0685 69.9449 133.2679 170.7293 149.3400 9.6233 7.7729 4.9898 21.7157 171.7753 178.4973 60.8574 77.0948 43.6366 10.4409 21.1980 0.0884 24.4995 26.3443 3.0677 26.0222 9.4156 25.9009 8.5317 9.8186
temp: 298.150 k
press: 1.00000 atm
elementType: 8 8 7 7 6 6 6 6 6 6 6 6 6 6 6 6 6 6 6 1 1 1 1 1 1 1 1 1 1 1 1 1 1
symmnumber: 1
zpe: 672921.5 jmol-1
zpe.correction: 0.256302 hartree
zpe.thermalcorrener: 0.273270 hartree
zpe.thermalcorrenthalpy: 0.274214 hartree
zpe.thermalcorrgfe: 0.209429 hartree
zpe.sumelectzpe: -838.566162 hartree
zpe.sumelectthermal: -838.549194 hartree
zpe.sumelectthermalent: -838.548250 hartree
zpe.sumelectthermalfe: -838.613035 hartree
dipole: -2.5042 -3.6176 1.1258
dipole: 4.5415
quadrupole: -68.7052 -108.9395 -116.0055
quadrupole: -10.2226 -3.9584 0.7486
quadrupole: 29.1782 -11.0561 -18.1221 -10.2226 -3.9584 0.7486
hfenergy: -838.8224639 hartree
pointgroup: C01 [X(C15H14N2O2)]
dipole: 0.9821648 1.4384388 0.3984734 debye
polarizability: 416.5220363|-7.4745217|176.4142816|7.0857747|-3.0438581|81.3129498 unknown
InChI: InChI=1S/C15H14N2O2/c1-19-14-9-7-13(8-10-14)15(18)17-16-11-12-5-3-2-4-6-12/h2-11,17H,1H3
charge 0 multiplicity 1
33 atoms
O  6.16413 1.006937 -0.019498
O  0.503698 -2.155629 -0.040542
N  -0.245276 0.068361 0.060823
N  -1.57907 -0.278171 -0.007724
C  2.161191 -0.380028 -0.018723
C  3.198598 -1.2590 0.37965
C  2.509962 0.937465 -0.43302
C  4.870326 0.478453 0.001762
C  4.544168 -0.844245 0.399728
C  3.847412 1.365131 -0.423967
C  0.76051 -0.921437 -0.012182
C  -3.904439 0.411758 0.06764
C  -4.825836 1.484933 0.217215
C  -4.403403 -0.906239 -0.144768
C  -2.463994 0.68733 0.135666
C  -6.21618 1.250297 0.155749
C  -5.790828 -1.13501 -0.20531
C  -6.70377 -0.059945 -0.055989
C  7.267738 0.131861 0.392146
H  2.924075 -2.279041 0.668078
H  1.748419 1.629368 -0.813058
H  5.319644 -1.546286 0.719277
H  4.129372 2.369835 -0.7522
H  -4.449904 2.503078 0.381615
H  -3.685607 -1.725094 -0.257226
H  0.029893 1.046832 0.233792
H  -2.167011 1.743291 0.310799
H  -6.916776 2.084563 0.272298
H  -6.167544 -2.150924 -0.368441
H  -7.782819 -0.244071 -0.103981
H  7.34631 -0.751942 -0.269404
H  7.147972 -0.196187 1.442462
H  8.172238 0.749555 0.296333
