program: Gaussian 09
title: 000266161
version: EM64L-G09RevD.01
frameworkgroup: C1[X(C4H10N2)]
method: RPBEPBE
basis: SDD
operation: Freq
keyword: #pfreq=noraman
keyword: PBEPBE/SDD
title: #p freq=noraman PBEPBE/SDD
converged: YES YES NO NO
title: Mulliken charges:
elementType: N N C C C C H H H H H H H H H H
charge: -0.321996 0.019893 -0.392955 -0.672005 -0.243590 -0.581124 0.200094 0.225436 0.216554 0.223892 0.205228 0.187929 0.259298 0.249498 0.210730 0.213119
chargesum: 0.00000
title: Mulliken charges with hydrogens summed into heavy atoms:
elementType: N N C C C C
charge: -0.062698 0.019893 0.032575 -0.026332 -0.055661 0.092222
polarizability: 9.60781886e+01 1.97897591e+00 5.14473718e+01 -3.69566575e+00 2.67979057e+00 4.40969251e+01
1716.lowfreq: -23.0000 -5.9392 -0.0008 -0.0008 -0.0004 4.9096 60.7488 130.0969 154.7726
frequency: 60.7089 130.0758 154.7701 171.3760 214.0971 249.7929 390.8683 453.4308 497.4014 565.8128 774.2662 870.2194 905.2880 945.2648 1039.2268 1066.5857 1116.9494 1138.3487 1179.4607 1190.8567 1249.6373 1296.8909 1338.3755 1384.7306 1427.1707 1457.3933 1463.8724 1475.0988 1478.3164 1483.4919 1503.2696 1604.5047 2932.9524 2943.6122 2961.5899 2975.6611 3045.4842 3048.8975 3073.5267 3082.8947 3103.2649 3383.3086
redmass: 2.4598 1.1669 3.2884 1.7776 1.9345 1.4028 3.6399 2.4078 2.1928 1.6931 1.2006 1.4399 1.6542 2.3563 2.6301 1.6257 1.3589 2.1100 2.6369 2.0968 1.1933 1.3132 1.4673 1.2037 1.1340 1.0796 1.0952 1.0734 1.1635 1.0739 1.1464 6.9454 1.0493 1.0840 1.0666 1.0361 1.0836 1.0947 1.0983 1.1009 1.1002 1.0746
irintensity: 0.1366 7.3381 22.8271 1.0601 26.1034 1.0536 2.7484 48.3300 21.0770 72.9205 5.3355 32.2295 12.4714 23.5257 2.2410 4.9358 34.2138 7.9522 96.8650 3.7535 5.4656 14.0989 9.9263 11.5203 6.8485 11.1208 17.7773 6.8632 7.2285 8.4870 28.0307 30.1707 139.7647 72.2081 37.2885 42.8174 46.0452 2.1741 66.3793 52.6331 19.5115 8.7642
temp: 298.150 k
press: 1.00000 atm
elementType: 7 7 6 6 6 6 1 1 1 1 1 1 1 1 1 1
symmnumber: 1
zpe: 363836.7 jmol-1
zpe.correction: 0.138578 hartree
zpe.thermalcorrener: 0.146625 hartree
zpe.thermalcorrenthalpy: 0.147569 hartree
zpe.thermalcorrgfe: 0.106414 hartree
zpe.sumelectzpe: -267.374647 hartree
zpe.sumelectthermal: -267.366600 hartree
zpe.sumelectthermalent: -267.365656 hartree
zpe.sumelectthermalfe: -267.406811 hartree
dipole: -0.5401 1.3344 1.1667
dipole: 1.8530
quadrupole: -32.3058 -36.6893 -39.6046
quadrupole: -0.6992 -2.6140 1.0696
quadrupole: 3.8941 -0.4894 -3.4047 -0.6992 -2.6140 1.0696
hfenergy: -267.5132249 hartree
pointgroup: C01 [X(C4H10N2)]
dipole: 0.2096967 -0.2714137 -0.6432992 debye
dipolederiv: -1.158721 0.0593983 -0.1591947 -0.2578164 -0.4731578 0.1042228 0.6424763 0.0597267 0.050689 0.9344524 -0.0420894 -0.0115695 -0.0403531 -0.1289103 0.0484385 -0.5655841 0.0534364 -0.3490467 0.033391 -0.0252313 0.0019694 0.0051219 0.1644183 -0.0266448 -0.0677293 -0.0162786 0.054159 -0.0187312 -0.0492197 -0.0035711 -0.0073726 0.0177471 -0.026939 0.0717521 -0.0282074 0.0871077 -0.1731838 -0.0196028 0.0298929 -0.0895068 -0.2528142 -0.008504 -0.34707 0.0029597 0.4148303 0.5721542 -0.1532229 0.1241777 -0.0441777 0.3917542 -0.1032563 0.2703796 -0.1313197 0.1967282 -0.0897176 0.0937838 0.0044129 0.1020828 -0.1590526 0.0215896 0.0343514 0.0542013 0.0864935 0.0519865 -0.0228946 -0.0668707 -0.0313737 0.0810101 0.0115879 0.000609 -0.0159457 -0.1378079 -0.2120151 0.0031946 0.1062539 0.0080531 0.0801941 -0.0278734 0.1258983 -0.0223652 0.0350185 0.0740758 0.0863515 -0.0317657 0.0254747 -0.1465067 0.041073 -0.02762 0.0514586 0.0784903 0.0911333 -0.0195136 -0.0291796 -0.0070815 0.0694062 0.020266 -0.0842379 -0.0144473 -0.1840408 -0.0382545 0.0259043 0.042145 0.0419654 0.1841056 -0.0245916 0.0041858 0.0054926 -0.2558954 0.0114739 0.0576881 -0.058192 0.145579 0.3158378 -0.080721 0.0190281 -0.0386135 -0.0814314 0.1108718 0.0259858 0.0163304 -0.00165 0.0433979 -0.0947643 -0.0920096 -0.072101 -0.0783521 -0.1448183 -0.02331 0.0655782 -0.0297455 0.0766765 0.0682366 0.1445687 0.0531232 0.030446 -0.0440974 0.0027778 -0.0304172 0.1808004 -0.2641061 0.0778799 -0.1289984 0.0588799 0.052612 unknown
polarizability: 95.9894615|-4.6650328|43.3129928|0.7027351|-0.0702494|52.3200313 unknown
InChI: InChI=1S/C4H10N2/c1-3-4-6-5-2/h4-5H,3H2,1-2H3
charge 0 multiplicity 1
16 atoms
N  1.775944 0.037702 -0.474792
N  0.589784 0.118433 0.227581
C  -1.850224 0.406844 0.315318
C  -2.890876 -0.670945 -0.084208
C  -0.543477 0.251626 -0.42646
C  2.937956 -0.463363 0.258511
H  -2.279517 1.410766 0.112639
H  -1.641136 0.357982 1.399161
H  -3.847415 -0.51202 0.447024
H  -2.52154 -1.682303 0.163307
H  -3.099361 -0.642229 -1.170636
H  -0.588991 0.261628 -1.537801
H  1.747545 -0.110056 -1.494906
H  2.963464 0.019641 1.248907
H  3.858968 -0.193066 -0.287742
H  2.924375 -1.564539 0.411795
