program: Gaussian 09
title: 000266158
version: EM64L-G09RevD.01
frameworkgroup: C1[X(C4H6O3S)]
method: RPBEPBE
basis: SDD
operation: Freq
keyword: #pfreq=noraman
keyword: PBEPBE/SDD
title: #p freq=noraman PBEPBE/SDD
converged: YES YES NO NO
title: Mulliken charges:
elementType: S O O O C C C C H H H H H H
charge: 0.941873 -0.393153 -0.393153 -0.506981 -0.394770 -0.394769 -0.116619 -0.116619 0.247041 0.209128 0.209128 0.247041 0.230926 0.230926
chargesum: 0.00000
title: Mulliken charges with hydrogens summed into heavy atoms:
elementType: S O O O C C C C
charge: 0.941873 -0.393153 -0.393153 -0.506981 0.061400 0.061400 0.114307 0.114307
polarizability: 9.28343126e+01 -1.14274498e-05 8.25378089e+01 2.40831639e+00 -5.08937262e-06 4.67041883e+01
1716.lowfreq: -0.0022 0.0013 0.0019 8.7171 14.8663 23.6240 85.5258 168.9631 209.9986
frequency: 85.5175 168.9595 209.9927 210.2523 233.9611 258.1245 322.7872 449.7569 470.9088 478.8434 516.0608 668.5384 716.8268 850.7936 858.3447 923.0676 964.9077 966.6871 975.9880 989.1520 1084.6474 1212.1974 1223.8301 1245.4051 1322.2352 1330.0999 1379.3216 1439.0895 1450.5435 1662.8836 2941.8814 2944.8388 3070.2685 3071.5417 3113.5955 3144.1238
redmass: 4.9457 3.6184 8.2237 2.5759 8.7929 5.4200 8.0681 2.6324 2.7195 9.7916 9.2967 3.2100 1.9553 3.0317 6.2763 4.0688 1.4316 2.4702 6.0694 2.1010 2.4625 1.0812 1.0812 1.0942 1.1836 1.2238 1.4291 1.1049 1.0888 6.9490 1.0678 1.0682 1.0932 1.0938 1.0861 1.0996
irintensity: 1.1419 0.8910 3.9237 0.5812 3.8731 0.3063 9.3156 9.5146 12.4338 78.1347 67.8010 3.1228 25.5300 53.6458 4.7546 146.3606 7.0519 13.5704 26.7424 0.0052 0.4863 0.5419 2.7482 0.2481 4.8162 5.2268 7.5961 2.2217 25.8121 0.6539 81.1718 13.2541 14.3205 0.2758 5.4845 32.4183
temp: 298.150 k
press: 1.00000 atm
elementType: 16 8 8 8 6 6 6 6 1 1 1 1 1 1
symmnumber: 1
zpe: 256933.8 jmol-1
zpe.correction: 0.097861 hartree
zpe.thermalcorrener: 0.106185 hartree
zpe.thermalcorrenthalpy: 0.107129 hartree
zpe.thermalcorrgfe: 0.064825 hartree
zpe.sumelectzpe: -778.980883 hartree
zpe.sumelectthermal: -778.972559 hartree
zpe.sumelectthermalent: -778.971615 hartree
zpe.sumelectthermalfe: -779.013919 hartree
dipole: 4.7128 0.0000 3.4916
dipole: 5.8653
quadrupole: -56.4080 -52.1141 -53.6602
quadrupole: 0.0000 -5.4740 0.0000
quadrupole: -2.3472 1.9467 0.4005 0.0000 -5.4740 0.0000
hfenergy: -779.0787439 hartree
pointgroup: C01 [X(C4H6O3S1)]
dipole: -1.7959253 0.0000341 -1.448987 debye
dipolederiv: 1.4117605 0.0000032 -0.0905839 0.0000003 1.0578885 0.0000143 0.0024534 0.0000144 0.5100374 -0.809144 -0.1639886 -0.0467764 -0.2244314 -0.5915015 -0.1427495 0.0762422 0.0444438 -0.3454405 -0.8091466 0.1639902 -0.0467689 0.2244266 -0.5915052 0.1427364 0.0762541 -0.0444559 -0.3454357 -0.756213 -0.0000041 0.1028412 0.0000078 -0.3036582 0.0000002 -0.3356914 -0.0000009 -0.3082188 0.540867 0.0600274 0.0674929 -0.1107238 0.2533002 0.0241833 0.1710258 0.1591414 0.3360553 0.5408673 -0.0600291 0.0674901 0.1107167 0.2533098 -0.024187 0.1710326 -0.1591449 0.3360463 -0.0334385 -0.0379827 -0.1618917 0.0037514 -0.087496 -0.0615175 -0.1757197 -0.1174451 -0.1527793 -0.0334382 0.0379911 -0.1618901 -0.0037417 -0.0875056 0.0615201 -0.1757202 0.1174474 -0.1527698 -0.0146989 -0.1078582 -0.0216568 -0.0259642 -0.070978 -0.0112018 -0.0229772 -0.0023926 0.1162979 0.0070229 0.029798 0.0444487 0.045363 0.088997 0.102262 -0.0262328 -0.0274878 -0.1536604 0.0070233 -0.0298008 0.0444476 -0.0453621 0.0890003 -0.102249 -0.0262354 0.0275006 -0.1536647 -0.0146996 0.1078595 -0.0216511 0.0259655 -0.0709773 0.0111916 -0.0229758 0.0023824 0.1162986 -0.0183806 -0.035973 0.1122481 -0.0624959 0.0305601 0.0421221 0.1442704 0.05801 0.0986194 -0.0183815 0.035967 0.1122503 0.0624878 0.0305659 -0.0421251 0.1442739 -0.0580127 0.0986141 unknown
polarizability: 92.5574294|-0.0000741|82.5378089|4.3006953|0.0009567|46.9810715 unknown
InChI: InChI=1S/C4H6O3S/c5-8-6-3-1-2-4-7-8/h1-2H,3-4H2
charge 0 multiplicity 1
14 atoms
S  1.570988 0.000019 -0.345454
O  0.531902 -1.469157 0.238324
O  0.531895 1.469159 0.238401
O  2.782226 -0.000006 0.688944
C  -0.798933 -1.540628 -0.42978
C  -0.798941 1.540658 -0.429698
C  -1.855142 -0.680399 0.238133
C  -1.855145 0.680387 0.23817
H  -1.056576 -2.610716 -0.36104
H  -0.69885 -1.284423 -1.507972
H  -0.698857 1.28451 -1.507904
H  -1.05659 2.61074 -0.360901
H  -2.643035 -1.208177 0.790506
H  -2.643041 1.208131 0.790571
