program: Gaussian 09
title: 000266170
version: EM64L-G09RevD.01
frameworkgroup: C1[X(C15H25N)]
method: RPBEPBE
basis: SDD
operation: Freq
keyword: #pfreq=noraman
keyword: PBEPBE/SDD
title: #p freq=noraman PBEPBE/SDD
converged: YES YES NO NO
title: Mulliken charges:
elementType: N C C C C C C C C C C C C C C C H H H H H H H H H H H H H H H H H H H H H H H H H
charge: -0.078165 0.311007 -0.465306 -0.415987 -0.473366 0.420472 -0.395972 -0.731496 -0.758210 -0.383532 -0.414515 -0.267032 -0.248280 -0.618905 -0.620888 -0.247612 0.217851 0.199540 0.203583 0.196818 0.206783 0.210137 0.218029 0.206868 0.216571 0.237810 0.212205 0.213878 0.223286 0.229707 0.218713 0.245997 0.221961 0.221161 0.186181 0.224210 0.219336 0.224780 0.188413 0.217596 0.226373
chargesum: 0.00000
title: Mulliken charges with hydrogens summed into heavy atoms:
elementType: N C C C C C C C C C C C C C C C
charge: -0.078165 0.311007 -0.047915 -0.015585 -0.056446 0.420472 0.028924 -0.064910 -0.091339 -0.164819 -0.168517 -0.045071 -0.027119 0.010822 0.009901 -0.021240
polarizability: 1.65229801e+02 -1.72575240e+01 1.75647224e+02 6.40157780e+00 3.82526260e+00 1.52447894e+02
1716.lowfreq: -17.3874 -14.8213 -2.3825 -0.0006 -0.0005 0.0004 8.7935 37.8648 41.9084
frequency: -9.1547 37.6449 41.2948 61.3380 80.6060 97.6593 113.4446 153.6548 167.7771 209.0346 211.1143 223.3941 228.3769 250.8922 284.0100 307.0862 315.5573 335.8435 337.9545 355.2149 401.8164 404.5550 431.0605 457.2702 487.6605 561.6591 593.4400 617.5024 691.9613 703.3358 750.9640 762.5957 774.9923 799.4681 819.6048 849.4252 867.8618 901.9651 928.5317 966.4745 972.9534 989.1068 991.8172 1014.5245 1017.7595 1027.5244 1029.7676 1043.0937 1047.8909 1065.3734 1079.9840 1085.9761 1094.7332 1101.8799 1129.8897 1143.5271 1159.9237 1172.4529 1184.4409 1199.5511 1212.2124 1243.0743 1256.9644 1277.7724 1285.0326 1305.6017 1312.8965 1321.5014 1326.4587 1346.9048 1373.7472 1379.2594 1389.3902 1392.4764 1416.2818 1431.5742 1439.7413 1458.3383 1460.1430 1463.7604 1471.5026 1474.3936 1476.0743 1480.3359 1480.8839 1483.2359 1484.9178 1488.9757 1495.1748 1498.6464 1586.2346 1609.9808 2842.3524 2847.5721 2863.1498 2976.5210 2978.9055 2979.7467 2983.2288 2998.4105 3014.2936 3015.0165 3024.1888 3025.4867 3026.6766 3052.5837 3069.5403 3069.7797 3073.9099 3076.1838 3078.1638 3083.3444 3115.4460 3123.5463 3137.0299 3152.0095 3164.0315
redmass: 2.6410 3.5188 3.5222 2.3187 2.9804 2.4023 2.4808 1.4720 2.5714 1.2274 1.7749 1.3344 1.9799 1.5044 2.0526 2.5084 2.0786 3.2069 2.2153 2.6368 3.2181 2.8197 2.2824 2.6347 2.9633 2.7267 2.8782 6.3943 3.9595 1.6349 1.3019 1.4321 1.9398 1.3908 2.8221 1.2544 1.9033 1.6269 1.6699 1.8446 1.3896 5.7030 1.3285 1.8764 1.9523 2.3788 1.5332 1.7341 2.6196 2.0712 1.8565 1.4334 1.9201 2.1183 1.4781 1.9476 1.9902 1.0555 2.9687 1.1821 2.1437 1.5149 2.3195 1.2741 1.2797 1.2266 1.3892 1.3864 1.4035 1.5395 4.0552 1.5107 1.2307 1.2034 1.1455 2.2438 1.1682 1.0682 1.0518 1.0611 1.0816 1.0549 1.0700 1.0600 1.1575 1.5197 1.0973 1.0728 1.0745 1.0926 5.7916 6.0043 1.0574 1.0644 1.0620 1.0459 1.0536 1.0380 1.0539 1.0609 1.0853 1.0735 1.0976 1.0999 1.0728 1.1005 1.0988 1.0985 1.1009 1.1001 1.1002 1.1001 1.0845 1.0870 1.0932 1.0950 1.0992
irintensity: 0.4680 0.1223 0.1057 0.1061 0.0212 0.9837 0.0569 0.0689 0.6348 0.7365 0.5688 0.0350 0.3695 0.9767 0.4147 1.3835 3.0942 2.8292 0.9017 2.0767 0.2289 0.0046 3.4261 2.7173 1.1250 3.0119 9.8465 0.0386 1.0892 54.4843 32.5134 16.0941 19.3492 8.4548 11.1342 0.2010 6.8796 4.4607 2.6791 6.4599 0.0319 0.2368 0.0330 15.4875 18.4264 7.1049 16.3392 9.0231 3.0543 11.0432 8.9945 7.4034 1.2260 2.6914 9.1949 5.7685 6.5971 0.0627 1.4647 0.2585 6.4760 2.7111 4.8408 0.2124 1.8957 2.5403 7.6184 1.3154 5.8531 3.0364 2.0607 1.4264 18.0658 17.1945 2.4839 6.2439 2.1292 0.6005 18.4357 10.7273 11.8244 14.3183 8.5857 3.9559 28.7774 11.7562 9.1323 8.8450 16.0931 6.1141 1.9959 10.4442 71.0660 58.2143 183.9927 32.9020 50.0424 21.7680 11.0612 19.3819 29.1599 45.2226 22.9027 18.6132 47.7902 60.3309 53.8175 30.7784 42.3340 39.9414 56.8372 51.7852 6.6127 0.9843 34.7497 39.5399 14.9494
temp: 298.150 k
press: 1.00000 atm
elementType: 7 6 6 6 6 6 6 6 6 6 6 6 6 6 6 6 1 1 1 1 1 1 1 1 1 1 1 1 1 1 1 1 1 1 1 1 1 1 1 1 1
symmnumber: 1
zpe: 957196.8 jmol-1
zpe.correction: 0.364577 hartree
zpe.thermalcorrener: 0.381993 hartree
zpe.thermalcorrenthalpy: 0.382937 hartree
zpe.thermalcorrgfe: 0.319666 hartree
zpe.sumelectzpe: -640.056263 hartree
zpe.sumelectthermal: -640.038847 hartree
zpe.sumelectthermalent: -640.037903 hartree
zpe.sumelectthermalfe: -640.101175 hartree
dipole: 0.0756 -0.3770 0.3188
dipole: 0.4994
quadrupole: -103.3104 -97.8899 -95.7317
quadrupole: 0.7603 -0.0483 2.3300
quadrupole: -4.3331 1.0874 3.2456 0.7603 -0.0483 2.3300
hfenergy: -640.4208403 hartree
pointgroup: C01 [X(C15H25N1)]
dipole: -0.0399295 0.1560182 0.1125729 debye
polarizability: 167.0289415|-17.8504162|173.4245618|-4.3963061|-6.3134519|152.8714158 unknown
InChI: InChI=1S/C15H25N/c1-5-15(6-2,12-13-16(3)4)14-10-8-7-9-11-14/h7-11H,5-6,12-13H2,1-4H3
charge 0 multiplicity 1
41 atoms
N  3.344121 0.523507 -0.146917
C  -0.254829 -1.08651 -0.16194
C  1.188024 -0.685481 -0.634761
C  -0.861767 -2.004036 -1.285867
C  -0.194036 -1.863601 1.192569
C  -1.128814 0.192074 -0.035314
C  1.985829 0.186577 0.355769
C  -2.280837 -2.54662 -1.013496
C  0.66723 -3.14499 1.193165
C  -1.292201 1.046162 -1.162626
C  -1.798912 0.563811 1.159945
C  -2.07962 2.214792 -1.100942
C  -2.590998 1.734447 1.22978
C  4.226245 0.998104 0.939942
C  3.32897 1.477324 -1.275728
C  -2.736786 2.568687 0.100795
H  1.776694 -1.598974 -0.842382
H  1.097318 -0.15624 -1.602202
H  -0.168856 -2.850965 -1.45844
H  -0.87536 -1.428908 -2.232658
H  0.18315 -1.18623 1.983856
H  -1.224151 -2.134681 1.494936
H  2.124087 -0.372846 1.300173
H  1.399237 1.108151 0.604961
H  -2.300119 -3.242035 -0.154446
H  -2.989504 -1.725392 -0.802133
H  -2.657326 -3.100214 -1.893469
H  0.632096 -3.625235 2.188579
H  0.30657 -3.886283 0.457359
H  1.727525 -2.933365 0.965949
H  -0.797188 0.797976 -2.109046
H  -1.71074 -0.056951 2.056126
H  -2.181755 2.848564 -1.989618
H  -3.093794 1.991217 2.169656
H  3.879999 1.954555 1.410305
H  4.287328 0.230885 1.732584
H  5.245456 1.163938 0.546003
H  2.766011 1.060479 -2.1277
H  2.872093 2.465046 -1.008131
H  4.36436 1.659099 -1.615885
H  -3.350051 3.475264 0.153453
