program: Gaussian 09
title: 000266196
version: EM64L-G09RevD.01
frameworkgroup: C1[X(C25H28O3)]
method: RPBEPBE
basis: SDD
operation: Freq
keyword: #pfreq=noraman
keyword: PBEPBE/SDD
title: #p freq=noraman PBEPBE/SDD
converged: YES YES NO NO
title: Mulliken charges:
elementType: O O O C C C C C C C C C C C C C C C C C C C C C C C C C H H H H H H H H H H H H H H H H H H H H H H H H H H H H
charge: -0.436194 -0.312911 -0.241842 0.391756 -0.146160 -0.061336 -0.226628 -0.483708 -0.587877 -0.589536 -0.512701 -0.081516 -0.498665 -0.783667 0.314055 -0.583091 0.340917 -0.404750 -0.621152 -0.362339 0.380964 0.160278 0.214895 -0.331147 -0.330794 -0.222411 -0.216856 -0.223033 0.190091 0.195718 0.218694 0.181134 0.211654 0.224986 0.229172 0.226224 0.229105 0.224728 0.221831 0.235772 0.217126 0.204713 0.217995 0.210358 0.218873 0.225815 0.225075 0.316140 0.236238 0.256606 0.303271 0.269525 0.266109 0.233972 0.231345 0.233180
chargesum: 0.00000
title: Mulliken charges with hydrogens summed into heavy atoms:
elementType: O O O C C C C C C C C C C C C C C C C C C C C C C C C C
charge: -0.120054 -0.312911 -0.241842 0.391756 0.043930 0.134381 -0.007933 -0.090920 -0.133718 -0.134207 -0.066142 0.154256 -0.076826 -0.136443 0.314055 -0.132202 0.340917 -0.168512 -0.364545 -0.059068 0.380964 0.160278 0.214895 -0.061622 -0.064685 0.011561 0.014490 0.010147
polarizability: 4.38330392e+02 2.08890878e+00 2.56805011e+02 2.46478481e+00 -1.06929753e+01 1.66756828e+02
1716.lowfreq: -15.0016 -3.2222 -0.0009 0.0008 0.0015 4.1378 9.3373 20.1240 41.4804
frequency: 8.0890 19.7994 41.3681 47.1662 55.9193 71.9093 75.9886 95.2062 128.3973 150.0918 168.8349 178.2469 189.8324 209.6681 213.8264 232.1267 250.9434 266.8890 284.2991 287.8918 303.4256 324.2979 339.4301 370.8248 381.7189 395.3676 403.8194 407.8407 429.6751 442.1940 451.7703 457.1973 465.6776 500.8238 516.5253 555.1316 566.3715 598.1213 601.2642 614.0176 636.2104 650.6372 671.1815 677.1446 699.7253 703.9994 718.9593 727.3800 772.2812 784.0852 793.6590 801.3134 816.8072 840.1197 848.9351 859.9761 863.5589 883.4111 899.8186 906.6057 928.7934 933.7617 952.3920 954.6059 965.7394 975.5584 983.2000 987.0639 990.3458 996.0646 1008.7486 1011.4599 1016.9652 1032.3692 1042.0339 1047.4350 1051.1113 1060.9562 1074.0086 1085.1354 1097.1418 1116.0781 1119.0254 1128.0885 1134.9123 1148.7468 1153.8198 1174.0137 1177.1693 1181.7570 1194.8812 1199.5059 1201.7130 1218.1914 1226.9096 1236.5771 1243.2313 1248.4112 1262.5378 1276.2484 1277.8632 1286.9141 1296.0133 1305.2682 1309.6765 1314.9336 1320.8074 1325.6442 1327.7437 1331.0634 1342.2183 1360.7076 1369.2943 1380.0907 1383.9140 1390.0218 1390.7991 1419.9380 1437.8657 1450.4770 1454.7364 1456.4462 1463.2595 1465.4093 1471.0213 1476.0414 1481.1113 1483.9201 1487.0139 1576.2259 1584.0510 1610.1612 1617.3250 1624.9215 2932.4590 2944.4327 2948.4186 2951.8977 2956.9539 2971.1420 2983.8513 2984.3352 2990.2933 2990.7261 3012.7179 3022.1397 3038.4562 3043.7065 3048.9361 3049.9271 3058.1731 3073.5715 3078.7122 3116.8798 3130.5953 3140.1748 3143.2618 3156.0047 3167.8845 3181.7577 3213.8689 3546.5562
redmass: 4.5914 5.6770 5.6166 5.2219 4.7553 5.2380 3.7970 3.8498 4.2148 4.0909 4.9225 3.4497 2.6961 1.3835 2.8220 2.3678 3.7800 2.1516 3.0252 1.2044 3.7431 4.1646 2.9507 2.7222 3.6512 3.4081 2.8245 2.5427 2.8987 3.7257 3.1133 4.0586 3.8587 3.3832 4.9731 3.0504 2.9474 4.1499 3.9661 6.4335 2.5785 4.3986 5.1002 5.1827 1.6390 3.4731 3.1835 6.1795 4.7600 2.1483 2.0997 2.7816 2.8309 1.8627 2.1074 1.7154 1.2510 2.6199 1.5606 3.0268 1.9231 1.7532 2.3199 1.4224 1.6373 1.4636 2.1186 2.7199 6.2527 1.3852 1.3313 1.9696 3.0290 2.1072 2.4959 2.1408 2.3721 1.8437 2.0012 1.5991 1.9261 1.3634 1.7818 1.7966 1.8329 1.7808 1.7286 1.0571 1.5755 1.1738 1.7798 1.9110 1.5524 1.6304 1.8685 2.8079 1.9562 1.6348 1.4753 1.4724 1.3510 1.3725 1.4198 1.3319 1.3755 1.3177 1.5213 1.4362 1.4826 1.5018 1.4841 1.5130 1.5699 5.1823 1.1658 9.8624 1.2143 3.8297 2.2476 1.0834 1.1264 1.0868 1.0854 1.0803 1.0821 2.2478 1.0655 1.0870 2.4685 7.4872 6.7491 6.0840 7.5605 9.7440 1.0815 1.0652 1.0821 1.0831 1.0647 1.0376 1.0616 1.0625 1.0625 1.0629 1.0934 1.0941 1.1023 1.0984 1.1012 1.0988 1.0987 1.0928 1.0969 1.0904 1.0855 1.0916 1.0893 1.0941 1.0983 1.0969 1.0942 1.0658
irintensity: 0.6200 0.1148 0.5380 1.1667 2.5183 0.3630 0.1100 0.0534 0.0972 0.5771 0.8660 0.3102 0.2010 0.7744 0.9004 2.9270 1.6827 4.8403 0.8269 87.6507 7.3000 18.0646 0.9744 0.6620 1.0879 1.1614 0.0094 1.6086 0.6788 0.5781 7.9279 2.1387 2.2486 1.6217 1.6013 2.4019 3.1588 1.6451 6.6583 1.1188 8.1557 10.0233 18.6443 3.3995 79.2609 5.3618 2.0979 3.4660 3.9352 5.0959 25.5414 2.8532 6.5444 22.7147 12.7711 3.7845 0.1593 1.1291 24.9648 11.2235 2.1628 8.7243 5.4336 4.1667 7.1145 0.3513 18.3889 50.0750 4.5053 0.0440 0.3951 23.6594 169.3833 7.1625 166.6969 1.2358 53.8158 9.2521 13.5220 6.7908 2.4566 31.7893 85.3938 16.2911 40.6987 3.8243 200.0823 0.2546 41.0979 63.6042 9.8691 4.0472 18.3132 137.4106 44.7165 320.5742 38.3320 2.7598 0.9867 4.9814 0.5502 1.9609 1.8122 0.3115 2.8297 0.5654 1.7179 0.7703 1.1691 0.3443 1.2916 1.3463 1.2144 15.1864 37.1565 3.6503 11.7797 26.2060 13.3101 11.0723 8.1864 5.1826 5.3094 12.4614 7.9173 8.0100 7.2576 6.2203 134.7140 2.5661 30.3939 15.4549 19.4353 143.7643 19.2859 70.3604 17.2551 39.3390 24.2145 19.7787 55.3178 15.8225 15.8054 47.9381 59.0222 34.5773 35.1781 25.9983 27.6787 18.6602 33.0201 64.2527 64.4939 20.2173 0.0826 5.2757 10.9941 17.6115 26.1890 8.4872 3.9962 3.4794
temp: 298.150 k
press: 1.00000 atm
elementType: 8 8 8 6 6 6 6 6 6 6 6 6 6 6 6 6 6 6 6 6 6 6 6 6 6 6 6 6 1 1 1 1 1 1 1 1 1 1 1 1 1 1 1 1 1 1 1 1 1 1 1 1 1 1 1 1
symmnumber: 1
zpe: 1230031.7 jmol-1
zpe.correction: 0.468494 hartree
zpe.thermalcorrener: 0.493001 hartree
zpe.thermalcorrenthalpy: 0.493945 hartree
zpe.thermalcorrgfe: 0.412660 hartree
zpe.sumelectzpe: -1193.104071 hartree
zpe.sumelectthermal: -1193.079564 hartree
zpe.sumelectthermalent: -1193.078620 hartree
zpe.sumelectthermalfe: -1193.159905 hartree
dipole: 1.4364 3.4338 0.8583
dipole: 3.8198
quadrupole: -159.7587 -160.8139 -171.8147
quadrupole: -1.8271 -9.2151 -5.6714
quadrupole: 4.3704 3.3152 -7.6856 -1.8271 -9.2151 -5.6714
hfenergy: -1193.5725649 hartree
pointgroup: C01 [X(C25H28O3)]
dipole: 0.5775719 1.1553123 -0.7682131 debye
polarizability: 438.3715931|0.4008973|197.1886643|-0.6270397|-43.9286352|226.3319741 unknown
InChI: InChI=1S/C25H28O3/c1-25-12-11-21-20-10-8-19(28-24(27)16-5-3-2-4-6-16)13-17(20)7-9-22(21)23(25)14-18(26)15-25/h2-6,8,10,13,18,21-23,26H,7,9,11-12,14-15H2,1H3
charge 0 multiplicity 1
56 atoms
O  -6.961808 -2.167205 0.739949
O  3.40133 -0.115855 -0.061268
O  4.136728 -1.36737 1.794532
C  -5.178102 0.847324 0.461451
C  -4.620897 0.196715 -0.857181
C  -3.074732 0.118322 -1.013594
C  -2.370766 -0.377998 0.283913
C  -4.394044 0.302866 1.694547
C  -6.654163 0.34529 0.4747
C  -5.305977 -1.200767 -0.916955
C  -2.862542 0.413968 1.532609
C  -6.681742 -1.059536 -0.199297
C  -2.417969 1.432153 -1.509288
C  -5.148174 2.395218 0.457315
C  -0.844591 -0.334529 0.17177
C  -0.949906 1.176722 -1.907686
C  -0.174216 0.424568 -0.830728
C  -0.062426 -1.051334 1.111232
C  1.238931 0.453862 -0.844755
C  1.347399 -1.035042 1.105431
C  1.989236 -0.261172 0.10973
C  4.382883 -0.667669 0.783667
C  5.750265 -0.303692 0.310926
C  6.853989 -0.773024 1.071399
C  5.975781 0.481373 -0.850276
C  8.169565 -0.459436 0.675327
C  7.294737 0.791454 -1.243028
C  8.392986 0.323423 -0.482753
H  -5.011569 0.798108 -1.706928
H  -2.876646 -0.638239 -1.805928
H  -2.661846 -1.437445 0.452669
H  -4.644702 -0.766869 1.862588
H  -4.725349 0.844398 2.603035
H  -7.279927 1.04553 -0.112522
H  -7.087335 0.303609 1.491764
H  -5.415634 -1.556397 -1.956763
H  -4.702349 -1.962964 -0.3874
H  -2.55464 1.474144 1.448498
H  -2.358383 0.020572 2.435926
H  -7.522482 -1.145215 -0.906384
H  -2.455901 2.212636 -0.726442
H  -2.977631 1.824221 -2.38059
H  -4.125765 2.802047 0.540582
H  -5.595044 2.795261 -0.47254
H  -5.732528 2.79288 1.309211
H  -0.438054 2.130066 -2.140945
H  -0.931343 0.578602 -2.843277
H  -6.26084 -2.168402 1.44114
H  -0.571206 -1.650788 1.876817
H  1.774089 1.035604 -1.603462
H  1.925622 -1.592938 1.841258
H  6.656516 -1.377014 1.963151
H  5.119707 0.837781 -1.428888
H  9.018424 -0.822392 1.264612
H  7.468111 1.396628 -2.139444
H  9.416033 0.566949 -0.790726
