program: Gaussian 09
title: 000266162
version: EM64L-G09RevD.01
frameworkgroup: C1[X(C11H22N2)]
method: RPBEPBE
basis: SDD
operation: Freq
keyword: #pfreq=noraman
keyword: PBEPBE/SDD
title: #p freq=noraman PBEPBE/SDD
converged: YES YES NO NO
title: Mulliken charges:
elementType: N N C C C C C C C C C C C H H H H H H H H H H H H H H H H H H H H H H
charge: -0.135241 0.014814 -0.112149 -0.131637 -0.449680 -0.044763 -0.016056 -0.383452 -0.712383 -0.735215 -0.638016 -0.713374 -0.710769 0.219814 0.211451 0.221426 0.208558 0.191657 0.193163 0.254159 0.229221 0.201894 0.236248 0.222357 0.214645 0.209194 0.211128 0.218278 0.249050 0.208933 0.214382 0.215137 0.215729 0.211487 0.210008
chargesum: 0.00000
title: Mulliken charges with hydrogens summed into heavy atoms:
elementType: N N C C C C C C C C C C C
charge: -0.135241 0.014814 0.107664 0.079814 -0.019695 0.146894 0.177108 -0.129293 -0.045020 -0.089019 0.040440 -0.074922 -0.073545
polarizability: 1.40479509e+02 6.82428167e+00 1.38572036e+02 7.46326892e+00 4.80624829e+00 1.11606460e+02
1716.lowfreq: -22.0690 -16.8312 -10.2030 -0.0006 -0.0002 0.0003 7.4684 49.0325 61.2070
frequency: -3.2826 47.0928 61.1783 95.4845 115.9997 159.6943 176.6290 187.7087 193.7319 199.7107 202.4491 222.3107 239.4979 259.5213 305.0969 314.1761 357.8860 366.3887 393.0764 451.0378 482.2383 522.7775 587.5522 646.0277 741.8671 780.4273 791.1442 804.0696 861.2272 865.4563 902.9414 910.4591 924.9568 938.8177 953.5035 956.1607 961.6910 975.3473 1001.9118 1033.2455 1085.6111 1089.0998 1111.5919 1121.2541 1150.0192 1161.2335 1186.6258 1191.7684 1216.6126 1234.0156 1240.7371 1260.7613 1269.4253 1281.1932 1312.3601 1316.9807 1322.4928 1334.5221 1346.7857 1360.9063 1375.0450 1379.5983 1393.3607 1397.3492 1427.9026 1457.4707 1461.9499 1463.5468 1468.6077 1469.8704 1473.2785 1478.7777 1482.7238 1484.8855 1487.2564 1491.7431 1527.7464 2921.6604 2944.9273 2953.8652 2968.6727 2969.7651 2971.0926 2977.0139 2977.7560 2996.3662 2999.2611 3028.1407 3038.6034 3061.7605 3063.3050 3064.8444 3066.0168 3069.5178 3069.7278 3072.3011 3079.0499 3098.9959 3196.5450
redmass: 2.6887 2.4278 3.2732 2.4385 2.7845 1.8294 2.2543 1.1139 1.6588 1.3516 1.3168 1.5864 1.6863 1.5143 2.6528 3.1185 2.1354 2.0622 2.1335 2.9562 4.3041 2.4613 2.8695 4.1421 1.2773 3.2870 2.5365 3.6713 4.2790 2.4343 1.3426 1.1827 1.6155 2.4657 1.5558 1.4879 2.0103 2.0412 2.3661 2.1121 1.6098 1.5483 1.3216 1.6435 2.2349 1.6954 1.9106 1.9844 1.4428 1.4674 1.6085 1.4167 1.6651 1.8266 1.8180 1.5278 1.4738 1.4634 1.4478 1.3353 1.2216 1.2171 1.2190 1.2140 1.1387 1.0830 1.0459 1.0466 1.0664 1.0529 1.0543 1.0464 1.0509 1.0554 1.0550 1.0489 6.9517 1.0509 1.0827 1.0783 1.0354 1.0356 1.0418 1.0599 1.0362 1.0841 1.0848 1.1009 1.0812 1.0995 1.0995 1.0999 1.0999 1.0987 1.0990 1.0991 1.0989 1.0998 1.0948
irintensity: 0.1703 0.0287 0.4860 0.2143 1.9749 4.2109 1.6850 0.2314 0.2724 0.6137 2.4688 0.0468 2.2238 1.6841 1.0106 2.3010 0.5375 0.0288 1.3397 3.1671 7.6894 2.3835 8.9462 2.3589 28.0951 8.3255 7.6147 1.3747 13.8514 3.6071 11.8378 0.3360 9.8043 10.6611 9.3425 0.1623 5.9961 1.8304 9.2488 7.2084 7.6217 6.4512 14.3950 1.4930 3.6489 20.6376 5.0304 8.9001 0.7503 3.9344 11.8006 8.0857 5.4814 17.0044 34.3843 1.9548 8.6802 0.8829 0.7623 1.3783 24.7264 17.7385 15.1031 19.6545 7.1987 7.7000 3.7291 1.6414 16.5537 5.6727 1.9836 15.8287 16.0179 17.2388 13.2866 18.3033 25.3019 118.8875 35.3267 14.3033 27.1693 44.7887 33.4178 20.2801 32.0256 30.9101 28.3352 31.8849 35.4580 7.8537 42.4600 30.9732 6.6837 92.4844 45.0363 94.1045 34.3355 19.6843 4.1484
temp: 298.150 k
press: 1.00000 atm
elementType: 7 7 6 6 6 6 6 6 6 6 6 6 6 1 1 1 1 1 1 1 1 1 1 1 1 1 1 1 1 1 1 1 1 1 1
symmnumber: 1
zpe: 818812.7 jmol-1
zpe.correction: 0.311869 hartree
zpe.thermalcorrener: 0.326960 hartree
zpe.thermalcorrenthalpy: 0.327905 hartree
zpe.thermalcorrgfe: 0.270699 hartree
zpe.sumelectzpe: -540.760948 hartree
zpe.sumelectthermal: -540.745857 hartree
zpe.sumelectthermalent: -540.744913 hartree
zpe.sumelectthermalfe: -540.802119 hartree
dipole: 2.0913 -1.6428 0.5221
dipole: 2.7102
quadrupole: -82.4879 -84.7838 -83.3497
quadrupole: 5.7029 -0.2227 2.9878
quadrupole: 1.0525 -1.2433 0.1908 5.7029 -0.2227 2.9878
hfenergy: -541.0728175 hartree
pointgroup: C01 [X(C11H22N2)]
dipole: 0.9156838 -0.5082064 0.2003826 debye
polarizability: 137.4251337|5.7747151|139.7077288|8.1059804|8.7596412|113.5251423 unknown
InChI: InChI=1S/C11H22N2/c1-8(2)6-11-10(9(3)4)7-12-13(11)5/h7-11H,6H2,1-5H3
charge 0 multiplicity 1
35 atoms
N  -0.623446 1.708377 0.308053
N  -1.652901 1.69583 -0.642875
C  0.238818 0.474446 0.197717
C  -0.720602 -0.502622 -0.574336
C  1.587855 0.74937 -0.529802
C  -1.383587 -1.605059 0.322383
C  2.752462 -0.238266 -0.216535
C  -1.731209 0.482733 -1.161826
C  -2.280732 -1.01549 1.435822
C  -2.169847 -2.61626 -0.545131
C  -0.121658 3.017946 0.715036
C  3.224829 -0.130768 1.25539
C  2.446442 -1.709871 -0.586879
H  0.439914 0.100362 1.220097
H  -0.167917 -1.026066 -1.377655
H  1.405085 0.773734 -1.623085
H  1.942929 1.761274 -0.249604
H  -0.548366 -2.155419 0.809211
H  3.60175 0.088639 -0.854298
H  -2.511638 0.253743 -1.88844
H  -3.147051 -0.484183 1.0001
H  -2.665247 -1.820342 2.089728
H  -1.732858 -0.291622 2.064578
H  -3.016711 -2.123074 -1.058088
H  -2.585361 -3.429444 0.07822
H  -1.524126 -3.07538 -1.317864
H  0.50398 3.522537 -0.05423
H  0.476079 2.9109 1.637587
H  -0.984368 3.669207 0.930421
H  2.448358 -0.479682 1.961782
H  3.479353 0.912935 1.519599
H  4.123712 -0.75265 1.423353
H  1.643639 -2.128909 0.04785
H  3.345286 -2.33818 -0.442304
H  2.132532 -1.806245 -1.643074
