program: Gaussian 09
title: 000266183
version: EM64L-G09RevD.01
frameworkgroup: C1[X(C22H22N2O4)]
method: RPBEPBE
basis: SDD
operation: Freq
keyword: #p
keyword: freq=noraman
keyword: PBEPBE/SDD
title: #p freq=noraman PBEPBE/SDD
converged: YES YES NO NO
title: Mulliken charges:
elementType: O O O O N N C C C C C C C C C C C C C C C C C C C C C C H H H H H H H H H H H H H H H H H H H H H H
charge: -0.314873 -0.314804 -0.282865 -0.282888 -0.367878 -0.367666 0.216426 0.216253 0.114817 0.114831 -0.033864 -0.033917 -0.538269 -0.538665 0.476814 0.477122 -0.359845 -0.359634 -0.445314 -0.445360 -0.222472 -0.222502 -0.215471 -0.215440 -0.239833 -0.239816 -0.519851 -0.519923 0.221234 0.292164 0.221264 0.292007 0.345825 0.345779 0.246163 0.246093 0.230472 0.230466 0.228577 0.228571 0.227243 0.227244 0.230299 0.230303 0.205486 0.279250 0.225829 0.279317 0.225826 0.205475
chargesum: 0.00000
title: Mulliken charges with hydrogens summed into heavy atoms:
elementType: O O O O N N C C C C C C C C C C C C C C C C C C C C C C
charge: -0.314873 -0.314804 -0.282865 -0.282888 -0.022052 -0.021887 0.216426 0.216253 0.114817 0.114831 -0.033864 -0.033917 -0.024872 -0.025395 0.476814 0.477122 -0.113681 -0.113541 -0.214842 -0.214894 0.006105 0.006070 0.011771 0.011804 -0.009534 -0.009513 0.190714 0.190694
polarizability: 4.51021120e+02 4.48760112e+01 2.19688805e+02 1.46788852e-01 -1.95739865e-01 2.19790982e+02
1716.lowfreq: -0.0007 0.0002 0.0007 3.3333 4.9170 7.8814 14.6303 19.0562 25.1982
frequency: 14.5274 18.5831 25.1286 26.7312 31.6574 33.6838 52.3434 72.0675 85.4501 88.3244 92.2467 143.2944 144.7926 159.1981 163.0113 185.6307 187.7371 191.3381 206.0773 239.4757 266.8810 272.0737 289.4767 295.3775 327.0900 330.5173 394.4824 403.6687 403.7556 405.7672 424.4603 432.5593 444.5944 448.0225 498.3606 498.4947 515.5579 530.1762 561.5694 613.2382 616.9943 617.1677 630.0231 648.6612 704.3301 704.4946 720.9816 748.5052 750.3275 788.4303 790.6247 808.5837 813.6287 831.9184 833.7295 837.1636 856.5831 857.1781 886.0140 913.0552 915.1278 943.9210 970.0053 979.1036 979.1784 989.5406 990.3216 992.0739 997.8565 999.0972 1025.8750 1026.5048 1054.7310 1058.5989 1084.8350 1088.0555 1094.3077 1098.5661 1109.5658 1110.0616 1158.8686 1159.4069 1172.8393 1172.8601 1187.5603 1187.7690 1212.0729 1212.9919 1241.0874 1243.7454 1251.8245 1263.6438 1305.9044 1309.7869 1322.7871 1328.9240 1353.8947 1359.2541 1386.2222 1387.0065 1423.3279 1423.7411 1442.5254 1443.0060 1449.4774 1449.6713 1473.7102 1477.6000 1482.5035 1485.3070 1488.0986 1488.9610 1492.2434 1493.9590 1544.8919 1556.9022 1595.4521 1595.6703 1615.1642 1615.2908 1621.8913 1627.2230 2968.7826 2969.1684 2971.7785 2972.6207 3067.8577 3068.3290 3085.6219 3085.7400 3115.3303 3115.4130 3125.3736 3125.4007 3127.7705 3127.7837 3136.3536 3136.3836 3147.7656 3147.8067 3164.3404 3164.4057 3330.4670 3336.4971
redmass: 5.7010 5.6630 3.8348 3.9216 5.4745 4.7237 4.0520 5.0867 2.4172 2.7696 4.2873 3.4439 1.4598 1.4314 5.1723 4.0387 3.9365 4.1302 4.6939 3.9985 4.4031 5.7037 3.7844 3.3243 7.6824 5.6368 5.3342 2.8518 2.8287 3.6958 3.7873 7.9884 5.1026 5.4511 4.1442 4.1374 6.0767 7.3709 5.6842 5.0708 6.3917 6.3500 8.4550 6.0394 1.8643 1.8604 11.0768 1.9029 1.7917 3.4140 2.7115 4.5438 1.5201 2.5556 1.5121 7.0853 1.2503 1.2502 7.0816 1.3981 1.3834 2.8822 2.2373 1.3916 1.3971 4.8855 6.2310 3.3070 1.3358 1.5238 2.2602 2.2105 3.5241 3.9725 1.7798 1.8443 3.4446 3.0944 1.2654 1.3222 1.5055 1.4658 1.0541 1.0543 1.1106 1.1114 2.6966 2.7256 1.2968 1.2502 2.3567 2.7678 2.5060 4.9147 1.3963 1.6331 1.4068 1.5798 6.0310 5.3749 1.2230 1.2026 2.1548 2.1489 1.0758 1.0676 1.5123 1.4312 2.1005 2.2031 1.1805 1.1061 1.9090 1.4004 2.4690 2.9900 6.1741 6.1432 6.0393 6.0232 10.3620 10.4112 1.0632 1.0620 1.0394 1.0406 1.0930 1.0931 1.0967 1.0967 1.0874 1.0874 1.0861 1.0861 1.1054 1.1054 1.0913 1.0913 1.0962 1.0962 1.1016 1.1016 1.0745 1.0753
irintensity: 0.0890 0.4971 0.0364 0.4478 0.4485 0.7318 0.0204 2.3297 3.6413 4.6713 2.1099 0.0522 0.0219 0.9220 0.0008 0.0698 4.9444 1.0346 2.4793 0.6804 2.3414 3.9347 15.7857 2.4795 4.1273 0.4194 11.1476 0.4472 3.4425 0.0064 36.8490 0.9024 1.4555 0.6843 28.3365 27.2782 20.0360 0.0969 9.4068 0.0646 0.1069 2.0592 6.7733 32.5163 7.1334 90.0118 3.8436 3.3435 91.9754 0.9436 2.2363 8.5793 115.0637 59.6155 11.2495 7.1279 7.4886 0.5286 12.8440 21.6133 2.2721 72.1974 10.7193 0.5581 0.3206 30.7607 0.3877 82.6276 0.0469 26.8440 23.6658 6.6289 31.0485 0.7616 0.5802 37.3391 106.2212 16.1754 19.6349 6.2318 2.2966 26.1792 0.1031 0.1409 8.2031 0.1679 2.5517 5.0403 3.1757 131.0124 2.9045 158.9193 3.6221 46.6923 1.2348 0.0386 67.8086 0.3670 45.3354 0.5409 3.3182 57.5130 76.0919 9.0746 65.9044 4.3632 545.9615 23.3775 257.6206 0.0347 28.0021 0.9056 0.0390 267.1808 6.6787 175.4657 4.8274 0.7517 23.9016 3.0082 460.9650 6.0802 23.0987 27.4388 84.7295 128.9020 33.1286 27.7053 48.6718 18.2021 7.9079 9.0883 2.6491 0.6862 16.2181 4.9556 11.2778 16.3592 59.2247 23.5269 30.4597 22.2821 0.2335 183.4087
temp: 298.150 k
press: 1.00000 atm
elementType: 8 8 8 8 7 7 6 6 6 6 6 6 6 6 6 6 6 6 6 6 6 6 6 6 6 6 6 6 1 1 1 1 1 1 1 1 1 1 1 1 1 1 1 1 1 1 1 1 1 1
symmnumber: 1
zpe: 1037037.9 jmol-1
zpe.correction: 0.394987 hartree
zpe.thermalcorrener: 0.421382 hartree
zpe.thermalcorrenthalpy: 0.422326 hartree
zpe.thermalcorrgfe: 0.334014 hartree
zpe.sumelectzpe: -1259.887976 hartree
zpe.sumelectthermal: -1259.861581 hartree
zpe.sumelectthermalent: -1259.860637 hartree
zpe.sumelectthermalfe: -1259.948949 hartree
dipole: -0.0012 0.0081 -2.1656
dipole: 2.1656
quadrupole: -129.9900 -173.2033 -147.1077
quadrupole: -4.0803 -0.0062 -0.1281
quadrupole: 20.1103 -23.1030 2.9927 -4.0803 -0.0062 -0.1281
hfenergy: -1260.2829628 hartree
pointgroup: C01 [X(C22H22N2O4)]
dipole: 0.0005199 0.0030427 0.8519946 debye
polarizability: 455.6959478|-30.1757359|215.0139473|0.0546767|0.2128415|219.791012 unknown
InChI: InChI=1S/C22H22N2O4/c1-27-21-17(23-13-15-9-5-3-6-10-15)20(26)22(28-2)18(19(21)25)24-14-16-11-7-4-8-12-16/h3-12,23-24H,13-14H2,1-2H3
charge 0 multiplicity 1
50 atoms
O  1.522318 2.462705 0.738096
O  -1.523376 -2.45689 0.754946
O  -1.360316 2.382671 0.716005
O  1.358756 -2.37692 0.729083
N  2.785676 -0.200315 0.800091
N  -2.786992 0.206934 0.801764
C  1.445065 0.033494 0.820791
C  -1.446396 -0.027027 0.822548
C  0.773181 1.264627 0.829866
C  -0.774449 -1.258096 0.838582
C  -0.665936 1.29697 0.781525
C  0.664578 -1.290752 0.789037
C  3.914641 0.746025 0.833374
C  -3.916311 -0.738847 0.841439
C  4.956203 0.423402 -0.233793
C  -4.956663 -0.424693 -0.229425
C  4.569006 0.2308 -1.584958
C  -4.568447 -0.247929 -1.582475
C  6.329234 0.346552 0.104539
C  -6.329559 -0.340053 0.107541
C  5.538875 -0.02902 -2.577308
C  -5.537208 0.003927 -2.577932
C  7.302844 0.091386 -0.888516
C  -7.302106 -0.092823 -0.888583
C  6.909846 -0.097558 -2.232877
C  -6.908114 0.080252 -2.234765
C  1.175099 3.540716 1.695627
C  -1.174282 -3.528965 1.718435
H  4.391422 0.709462 1.834386
H  3.500868 1.758245 0.696814
H  -4.394089 -0.693924 1.841614
H  -3.502583 -1.752154 0.713353
H  2.997542 -1.213829 0.759003
H  -2.998611 1.220206 0.754192
H  3.507789 0.284564 -1.854857
H  -3.507307 -0.307821 -1.851407
H  6.639116 0.485328 1.148138
H  -6.640212 -0.466629 1.152464
H  5.227976 -0.176298 -3.617681
H  -5.225541 0.138874 -3.619748
H  8.361941 0.034765 -0.613045
H  -8.361118 -0.030097 -0.614117
H  7.662086 -0.299185 -3.003619
H  -7.659489 0.275615 -3.007961
H  1.278965 3.182028 2.738409
H  0.147174 3.891201 1.513526
H  1.904097 4.341404 1.496207
H  -0.146226 -3.879613 1.537322
H  -1.902761 -4.331453 1.524444
H  -1.277404 -3.164265 2.759206
