program: Gaussian 09
title: 000266150
version: EM64L-G09RevD.01
frameworkgroup: C1[X(C7H7N3O2)]
method: RPBEPBE
basis: SDD
operation: Freq
keyword: #pfreq=noraman
keyword: PBEPBE/SDD
title: #p freq=noraman PBEPBE/SDD
converged: YES YES NO YES
title: Mulliken charges:
elementType: O O N N N C C C C C C C H H H H H H H
charge: -0.304841 -0.268016 -0.329466 -0.070537 -0.233433 0.033588 -0.261023 0.224944 -0.177939 -0.161797 -0.353928 -0.033164 0.282453 0.247546 0.384018 0.238045 0.252090 0.352243 0.179218
chargesum: 0.00000
title: Mulliken charges with hydrogens summed into heavy atoms:
elementType: O O N N N C C C C C C C
charge: -0.304841 -0.268016 0.054552 -0.070537 0.118811 0.033588 0.021430 0.224944 0.069607 0.076248 -0.101839 0.146054
polarizability: 1.72501246e+02 5.05836234e+00 1.14279279e+02 -2.43490486e-03 -1.36782202e-03 4.05720625e+01
1716.lowfreq: -4.3975 -0.0008 -0.0007 0.0004 5.6723 7.5013 51.6277 80.4086 102.6098
frequency: 51.6168 80.4056 102.6093 116.4001 195.7515 204.6283 266.3994 339.6955 396.1707 410.3725 461.2477 472.5784 615.4590 629.6991 681.6435 682.7779 734.3660 749.2015 755.5829 810.3425 904.8876 918.8418 925.9908 971.5179 971.8727 1013.7622 1016.4276 1034.5068 1085.0820 1119.2099 1162.2201 1226.3208 1245.0587 1287.9577 1330.2669 1357.5826 1399.2626 1424.8215 1455.9387 1523.9305 1559.4743 1572.1778 1583.2433 1631.0437 2990.6607 3139.7803 3151.1211 3170.5048 3181.4246 3476.5933 3487.8154
redmass: 5.9594 7.2736 5.8437 5.1025 6.7426 4.3885 8.9197 6.3025 3.3328 3.8455 4.0717 7.3719 7.4388 1.2229 7.1476 3.2224 1.1125 6.9634 1.6735 2.4026 6.5756 1.3093 1.5431 7.0960 1.4489 1.3429 3.3773 2.2992 1.6235 1.9983 1.0807 2.3399 2.3550 1.5349 6.3976 1.2902 2.2605 2.0542 2.6518 2.2869 7.3286 7.4454 5.9749 7.2332 1.0883 1.0883 1.0907 1.0953 1.1006 1.0817 1.0781
irintensity: 0.0309 4.9528 23.8552 0.0101 34.9563 8.6272 13.7635 5.3718 5.5029 15.2284 6.8530 5.5851 5.2418 54.9692 5.7179 75.0390 177.0110 1.5266 7.4837 20.9005 1.9551 0.6368 1.4309 4.8270 1.3700 0.5245 1.7511 11.3799 11.2635 9.2341 1.1560 26.9326 12.6676 0.5392 10.9389 42.2486 327.4517 84.4110 42.2859 1.1397 266.3503 274.1667 9.8384 103.0852 81.6336 5.5878 12.5336 11.5796 12.4091 3.3116 149.9114
temp: 298.150 k
press: 1.00000 atm
elementType: 8 8 7 7 7 6 6 6 6 6 6 6 1 1 1 1 1 1 1
symmnumber: 1
zpe: 365317.1 jmol-1
zpe.correction: 0.139142 hartree
zpe.thermalcorrener: 0.149483 hartree
zpe.thermalcorrenthalpy: 0.150427 hartree
zpe.thermalcorrgfe: 0.102148 hartree
zpe.sumelectzpe: -584.773291 hartree
zpe.sumelectthermal: -584.762950 hartree
zpe.sumelectthermalent: -584.762006 hartree
zpe.sumelectthermalfe: -584.810285 hartree
dipole: 3.5832 0.9534 0.0040
dipole: 3.7078
quadrupole: -52.3547 -75.7832 -71.6144
quadrupole: -13.2307 -0.0151 -0.0141
quadrupole: 14.2295 -9.1991 -5.0303 -13.2307 -0.0151 -0.0141
hfenergy: -584.9124326 hartree
pointgroup: C01 [X(C7H7N3O2)]
dipole: -1.4072374 -0.3797963 0.0588178 debye
dipolederiv: -0.6128999 0.2286717 -0.0010025 -0.2907964 -1.0300371 0.0334533 0.0178821 0.0169013 -0.3737773 -0.4801607 0.0838254 0.000139 -0.7848673 -1.0795745 0.0510214 0.0327294 0.0240925 -0.3720907 -0.5504807 -0.344096 0.0222047 -0.4357885 -0.6016238 0.0265945 0.0264325 0.0240383 -0.257349 -0.4723641 0.0124129 0.0076571 0.0650258 -0.3190631 0.0019848 0.0056277 0.0036772 -0.2076987 -0.9614511 -0.4089776 0.0363079 -0.5569509 -0.5388814 0.0271339 0.0410544 0.0228351 -0.2857915 0.3476635 -0.0281846 -0.0086026 0.1334187 0.003867 -0.0028622 -0.0147933 0.0019919 0.0364064 -0.3791822 0.0218175 0.0085868 -0.0356556 0.0360799 -0.0028296 0.0105664 -0.004519 -0.0737571 1.1014505 0.094876 -0.0317517 0.4951965 1.3141823 -0.0570355 -0.0458181 -0.0441703 0.1963919 0.2579557 0.0775478 -0.0143554 0.0408118 0.0989633 -0.0090949 -0.0130056 -0.0102808 -0.1164917 0.0003758 -0.189189 0.003666 0.0419312 -0.1868775 0.0018086 -0.0047016 0.0089153 -0.1016252 -0.0084137 0.1422705 -0.0067983 -0.1389684 0.3857335 -0.0119732 0.0033984 -0.0205757 -0.0638367 1.1967068 0.3144744 -0.0442224 1.1408628 1.4773038 -0.0859804 -0.0747097 -0.0604308 0.1430253 0.1558748 0.0246295 -0.0006176 0.005209 0.003965 0.005628 0.0001125 0.0050306 0.1649961 -0.0506148 -0.0774812 0.0089468 -0.0865553 0.0486287 0.0062927 0.0093272 0.0060445 0.1487137 0.3671172 -0.0712106 0.0021095 0.0227803 0.2586503 0.0025849 -0.0016988 0.0053312 0.3509988 -0.054713 0.0868933 0.0035734 0.0814308 0.0566592 0.001366 0.0038058 0.0012126 0.1638695 0.0708482 0.0052197 0.0018661 0.054349 -0.0951058 0.0067222 0.0000756 0.0081636 0.1373948 0.2187142 -0.0739656 0.0073276 0.0542613 0.2185273 0.0038049 0.0023976 0.0074124 0.3687224 -0.1464264 0.100466 0.0049659 0.1943053 -0.0513972 0.0013807 0.0013175 0.0043302 0.1418988 unknown
polarizability: 172.3279765|5.1760018|114.2172533|-4.2453906|-2.8564137|40.8073574 unknown
InChI: InChI=1S/C7H7N3O2/c11-5-9-10-7(12)6-3-1-2-4-8-6/h1-5,9-10H
charge 0 multiplicity 1
19 atoms
O  0.651584 -2.208024 0.021131
O  3.709074 1.610108 -0.214625
N  1.47386 -0.043115 -0.083874
N  -0.948933 1.058734 -0.048702
N  2.781866 -0.52112 -0.105601
C  -0.915029 -0.311045 -0.000303
C  -2.073413 -1.11669 0.064092
C  0.441979 -0.94828 -0.01839
C  -3.332094 -0.476014 0.079318
C  -3.38295 0.936305 0.029944
C  -2.167685 1.661301 -0.033406
C  3.844881 0.353325 -0.171298
H  -1.960566 -2.203871 0.099777
H  -4.253866 -1.064484 0.129008
H  1.324035 0.973259 -0.115083
H  -4.337928 1.470265 0.040072
H  -2.165239 2.755879 -0.072841
H  2.840325 -1.545951 -0.070491
H  4.817298 -0.180882 -0.180425
