program: Gaussian 09
title: 000266164
version: EM64L-G09RevD.01
frameworkgroup: C1[X(C15H22N2)]
method: RPBEPBE
basis: SDD
operation: Freq
keyword: #pfreq=noraman
keyword: PBEPBE/SDD
title: #p freq=noraman PBEPBE/SDD
converged: YES YES NO NO
title: Mulliken charges:
elementType: N N C C C C C C C C C C C C C C C H H H H H H H H H H H H H H H H H H H H H H
charge: -0.161595 0.003965 -0.069084 -0.143950 -0.368228 -0.397233 -0.369856 -0.353459 -0.539477 -0.710655 0.479325 -0.700889 -0.449269 -0.360832 -0.218535 -0.227782 -0.243959 0.196663 0.219399 0.223322 0.199505 0.210050 0.218473 0.256382 0.202684 0.193961 0.198252 0.253761 0.223212 0.210717 0.219792 0.212552 0.215492 0.214218 0.231126 0.256119 0.223817 0.225391 0.226622
chargesum: 0.00000
title: Mulliken charges with hydrogens summed into heavy atoms:
elementType: N N C C C C C C C C C C C C C C C
charge: -0.161595 0.003965 0.127579 0.075450 0.054600 0.031290 -0.113474 0.043186 -0.087464 -0.056934 0.479325 -0.058626 -0.218143 -0.104713 0.005282 -0.002391 -0.017337
polarizability: 2.20114443e+02 -2.33754218e+01 1.46572143e+02 -4.33619711e+00 1.06956749e+00 1.46573317e+02
1716.lowfreq: -11.1938 -6.2068 -0.0002 0.0004 0.0007 4.7503 16.6465 27.5485 37.3426
frequency: 15.5437 27.3059 37.2527 59.3653 75.1951 83.3573 104.5701 120.9666 171.5236 201.9920 211.1969 221.6664 230.0666 262.3893 288.7023 300.6252 330.4755 367.6668 403.9121 426.6065 471.3937 510.0201 554.5211 600.5420 616.4672 641.8943 704.2147 736.5493 739.4082 754.8375 766.8605 805.1369 816.5134 832.9312 840.6441 856.7861 896.2068 897.8014 902.0167 926.4251 959.2499 978.6412 985.5554 989.9204 995.5453 1024.7974 1036.1727 1045.0266 1057.3790 1079.1278 1084.5192 1098.3823 1103.3637 1117.5973 1145.5119 1170.5379 1182.4010 1196.9190 1212.8418 1219.2418 1229.4221 1241.2475 1249.4279 1256.9708 1278.3039 1287.8624 1307.1010 1313.0365 1326.7388 1330.7181 1336.6957 1351.9232 1358.7415 1387.9431 1389.8964 1390.1266 1440.8971 1456.0159 1461.8505 1469.0514 1474.2746 1475.5259 1477.4779 1483.8458 1484.3512 1487.1115 1540.4453 1595.1006 1614.7498 2874.9176 2898.4513 2938.8778 2960.8161 2973.2457 2976.5942 2978.3017 2982.2512 3006.1708 3028.6387 3035.1740 3046.1182 3070.2197 3071.5033 3072.4451 3077.7845 3111.8603 3122.9265 3135.1784 3146.4397 3161.6560 3189.3524
redmass: 3.6289 3.8127 4.0432 2.7425 2.9017 1.8067 2.1369 3.1597 3.1414 1.9045 1.9713 2.1671 1.5285 2.2263 3.0900 2.8505 3.4041 3.6260 2.8221 2.7660 3.1583 2.6823 4.3795 5.1487 6.0515 3.5666 1.9952 1.5690 1.1627 1.3061 1.5051 3.0904 4.1144 2.0361 2.4627 1.2532 1.8928 1.5188 1.7372 1.6868 1.8001 1.3863 2.2912 6.1751 1.3301 2.2089 2.8080 1.7475 2.4323 1.5927 1.6881 2.2366 2.0211 2.3123 2.3483 1.0573 1.1134 3.0542 1.5058 2.0455 1.3552 1.4016 1.5124 1.3034 1.3029 1.1042 1.3511 1.3518 1.3868 1.4396 1.5794 1.4758 1.6218 3.5492 1.2220 1.3195 2.0629 1.1286 1.0791 1.0720 1.0590 1.0432 1.0452 2.1699 1.0746 1.0799 7.6714 6.1390 6.1032 1.0830 1.0702 1.0823 1.0592 1.0363 1.0387 1.0575 1.0600 1.0991 1.1014 1.0882 1.1026 1.1005 1.0998 1.0996 1.0997 1.0871 1.0860 1.0913 1.0959 1.1014 1.0944
irintensity: 0.1877 0.2401 0.3323 0.0477 0.2060 0.1018 0.2634 0.7366 0.2078 0.8464 1.0915 6.5772 2.4558 0.4737 3.6971 0.4081 0.8713 1.1387 0.4249 9.9024 2.2767 7.9194 1.5928 8.4060 1.4340 18.6009 44.5389 28.4288 10.5620 28.8653 27.2997 3.2424 22.1134 8.3570 34.0401 0.2594 34.8708 6.0463 4.5212 14.8443 2.2926 0.1851 16.3405 0.9500 0.3692 16.9763 19.5797 10.5230 12.8753 4.0957 7.6073 0.1825 6.2198 1.9539 5.8257 0.1244 2.9729 14.1895 4.6143 17.8189 19.0462 10.8524 2.3872 0.0577 3.8783 1.9537 1.4872 14.9901 6.0862 1.7689 5.2405 25.3608 3.2155 12.7082 12.2572 7.5968 10.5126 16.6016 0.1016 2.6246 3.2332 11.4044 12.1840 8.1110 15.6122 9.0240 30.4837 0.8560 6.1209 33.1563 71.0928 21.8928 32.1447 30.8751 48.1821 15.2309 43.9755 5.6480 13.8972 6.2333 21.8369 55.9884 62.8851 49.8256 50.1256 8.9255 0.0714 17.9932 36.1972 25.8778 5.3675
temp: 298.150 k
press: 1.00000 atm
elementType: 7 7 6 6 6 6 6 6 6 6 6 6 6 6 6 6 6 1 1 1 1 1 1 1 1 1 1 1 1 1 1 1 1 1 1 1 1 1 1
symmnumber: 1
zpe: 884339.7 jmol-1
zpe.correction: 0.336827 hartree
zpe.thermalcorrener: 0.354435 hartree
zpe.thermalcorrenthalpy: 0.355379 hartree
zpe.thermalcorrgfe: 0.288936 hartree
zpe.sumelectzpe: -692.964396 hartree
zpe.sumelectthermal: -692.946788 hartree
zpe.sumelectthermalent: -692.945844 hartree
zpe.sumelectthermalfe: -693.012287 hartree
dipole: 0.8635 2.1927 1.1700
dipole: 2.6311
quadrupole: -95.8438 -111.1948 -99.4568
quadrupole: -1.3666 -0.3537 -2.7169
quadrupole: 6.3214 -9.0297 2.7084 -1.3666 -0.3537 -2.7169
hfenergy: -693.3012229 hartree
pointgroup: C01 [X(C15H22N2)]
dipole: 0.6963399 0.7543397 0.1326436 debye
polarizability: 190.8209709|-42.4657221|176.1500735|6.49319|-2.9404585|146.2888585 unknown
InChI: InChI=1S/C15H22N2/c1-3-8-15-14(4-2)11-16-17(15)12-13-9-6-5-7-10-13/h5-7,9-11,14-15H,3-4,8,12H2,1-2H3
charge 0 multiplicity 1
39 atoms
N  0.085846 -1.281981 0.34501
N  0.441028 -2.65342 0.37547
C  1.321454 -0.41172 0.354828
C  2.470781 -1.430234 0.032381
C  1.21126 0.770503 -0.632881
C  3.716728 -1.303531 0.949439
C  1.738472 -2.761845 0.168612
C  2.443141 1.703564 -0.619215
C  -1.065387 -0.941013 1.198897
C  4.875672 -2.237766 0.539907
C  -1.974901 0.134444 0.612334
C  2.272674 2.910046 -1.567568
C  -2.45468 1.192291 1.421569
C  -2.394935 0.060687 -0.740122
C  -3.343284 2.15913 0.894414
C  -3.279982 1.023808 -1.270184
C  -3.75917 2.076998 -0.453657
H  1.464213 -0.007766 1.387651
H  2.801031 -1.288358 -1.020199
H  0.307649 1.362609 -0.391613
H  1.056008 0.362158 -1.651504
H  3.413876 -1.51406 1.994174
H  4.068259 -0.253033 0.927751
H  2.187804 -3.752372 0.07704
H  3.350934 1.136667 -0.908958
H  2.618267 2.067363 0.414607
H  -0.730622 -0.628298 2.216051
H  -1.629649 -1.884203 1.320163
H  4.577562 -3.30061 0.59475
H  5.203923 -2.033202 -0.496844
H  5.749249 -2.101155 1.202797
H  2.124767 2.575343 -2.611655
H  1.391026 3.515038 -1.283916
H  3.158821 3.570784 -1.546518
H  -2.132367 1.261124 2.468583
H  -2.008389 -0.750257 -1.36794
H  -3.706025 2.973486 1.532115
H  -3.598539 0.95513 -2.316752
H  -4.446815 2.824752 -0.864921
