program: Gaussian 09
title: 000266151
version: EM64L-G09RevD.01
frameworkgroup: C1[X(C12H8N4S)]
method: RPBEPBE
basis: SDD
operation: Freq
keyword: #p
keyword: freq=noraman
keyword: PBEPBE/SDD
title: #p freq=noraman PBEPBE/SDD
converged: YES YES NO NO
title: Mulliken charges:
elementType: S N N N N C C C C C C C C C C C C H H H H H H H H
charge: 0.393659 -0.052454 -0.413820 0.007563 0.000806 0.533648 0.324037 -0.386507 0.104869 -0.297457 -0.300338 -0.304469 -0.272714 -0.337138 -0.341159 -0.340274 -0.341513 0.270298 0.231631 0.262660 0.268306 0.250975 0.249760 0.244042 0.245591
chargesum: 0.00000
title: Mulliken charges with hydrogens summed into heavy atoms:
elementType: S N N N N C C C C C C C C C C C C
charge: 0.393659 -0.052454 -0.413820 0.007563 0.000806 0.533648 0.324037 -0.386507 0.104869 -0.027159 -0.068707 -0.041810 -0.004409 -0.086162 -0.091400 -0.096233 -0.095922
polarizability: 2.91156752e+02 -2.52678562e-02 1.87414127e+02 -1.26542924e-01 1.73758655e-01 6.53410928e+01
1716.lowfreq: -9.4652 -0.4889 -0.0016 -0.0016 -0.0002 7.7368 29.0579 38.9229 67.0688
frequency: 29.0091 38.9111 67.0687 78.7142 115.8430 160.9234 242.1896 245.2713 268.1673 301.4498 355.1486 361.8327 367.3836 462.6473 469.6943 504.6845 601.6554 605.5577 637.7596 652.0202 661.5355 666.2435 704.9246 711.4058 740.5404 748.8851 833.5458 845.4056 861.8766 884.6914 897.2658 934.8800 957.7996 958.7047 969.8556 983.1184 986.4766 987.4466 1058.4544 1059.8027 1074.1873 1082.5637 1095.7501 1212.5024 1217.1957 1234.2787 1258.3632 1298.1495 1302.2614 1328.8121 1332.1079 1392.3384 1402.6368 1406.7280 1450.4603 1475.4651 1505.6313 1546.0928 1554.8832 1582.7011 1590.8017 3130.9143 3137.5226 3141.3200 3143.6711 3155.3431 3174.9305 3178.8530 3180.1509
redmass: 3.7230 4.5600 6.6717 9.7837 8.0309 6.3114 8.1461 7.5113 9.9383 9.4355 7.5736 2.4807 2.5116 5.9721 9.3480 4.2327 12.5324 4.7411 9.7243 7.9308 7.1278 7.8133 5.8277 9.9154 3.1152 3.2658 1.4799 1.5168 8.7053 1.2565 1.2502 7.5888 6.7295 6.9270 1.4214 1.3860 1.4367 1.4634 2.4759 2.2319 2.1796 1.7230 2.0668 1.4124 1.3450 2.9913 5.5634 6.8485 9.4192 1.4419 1.4905 3.1518 1.9255 2.2219 2.1200 2.6195 6.7566 7.5256 7.9592 5.6896 5.8901 1.0884 1.0887 1.0913 1.0899 1.0976 1.0953 1.0969 1.0964
irintensity: 0.0091 0.0517 0.4622 0.4561 0.6489 1.2256 8.3148 0.2453 2.7440 0.6972 5.3652 0.0002 0.0016 4.6274 1.9685 20.2517 12.9104 1.4169 14.8524 16.7628 4.5337 4.4531 27.1672 19.5840 1.5261 6.9775 40.3728 63.4504 1.9570 2.4052 0.0130 25.6366 4.1674 1.2530 0.1738 0.8699 1.1157 0.0622 23.9474 0.6714 9.4135 1.1685 5.7823 8.2650 0.6014 24.6591 15.2794 0.2681 5.7499 9.1094 10.1316 96.3565 23.9367 34.7576 55.1550 7.0444 47.3997 2.9616 14.9659 31.8890 14.9900 7.9430 24.8401 14.0639 18.5446 14.9923 7.0352 2.2627 5.1869
temp: 298.150 k
press: 1.00000 atm
elementType: 16 7 7 7 7 6 6 6 6 6 6 6 6 6 6 6 6 1 1 1 1 1 1 1 1
symmnumber: 1
zpe: 464183.4 jmol-1
zpe.correction: 0.176798 hartree
zpe.thermalcorrener: 0.190064 hartree
zpe.thermalcorrenthalpy: 0.191008 hartree
zpe.thermalcorrgfe: 0.134646 hartree
zpe.sumelectzpe: -1077.958035 hartree
zpe.sumelectthermal: -1077.944770 hartree
zpe.sumelectthermalent: -1077.943826 hartree
zpe.sumelectthermalfe: -1078.000188 hartree
dipole: -2.1595 0.8711 -0.0040
dipole: 2.3286
quadrupole: -126.5591 -98.2956 -108.5347
quadrupole: -2.5250 -0.0447 0.1096
quadrupole: -15.4293 12.8342 2.5951 -2.5250 -0.0447 0.1096
hfenergy: -1078.1348335 hartree
pointgroup: C01 [X(C12H8N4S1)]
dipole: 0.8441728 0.3536503 0.040077 debye
dipolederiv: -0.2771083 -0.2875318 -0.0311034 0.0740304 -0.2490734 -0.0437193 0.006608 -0.0444953 0.1802604 -1.0183829 -0.243082 -0.0287131 -0.1038975 -0.5051993 -0.0368849 -0.0147857 -0.0369468 -0.1502308 -0.2071493 0.3139844 0.0325034 -0.1511627 -0.2273735 0.0043702 -0.0171451 0.0070659 -0.280145 -0.4330759 0.0513859 0.0044161 0.0368235 -0.2728954 -0.002371 0.0032601 -0.0027035 -0.2440059 -0.4414082 -0.0459239 -0.0055274 -0.0499818 -0.2790452 -0.0033465 -0.0059628 -0.0033375 -0.2483437 0.1170205 -0.0021022 -0.0006593 0.1187064 0.0273806 -0.0033351 0.0114773 -0.0030243 0.0523799 0.2219858 0.0036259 0.0013482 0.0222977 0.1170155 0.0080606 0.0032024 0.0080218 0.0379343 0.6655626 -0.0532977 -0.0022175 -0.3074228 0.8313557 0.0871123 -0.0287586 0.0862091 -0.0247141 0.9754514 0.2178965 0.0258059 0.3006862 0.1157921 0.0027905 0.0365799 0.0022341 0.1024528 -0.2223059 0.2564573 0.0225625 0.0256675 -0.1709349 -0.0100089 0.0013197 -0.0095288 -0.0608693 -0.3146836 -0.1357914 -0.011949 0.079279 -0.0117796 0.005564 0.0093312 0.0056657 -0.0830451 -0.2176336 -0.2363843 -0.0244361 -0.0535279 -0.2031943 -0.0127789 -0.0061527 -0.013847 -0.079458 -0.3635721 0.1294154 0.0115215 -0.1177342 -0.0120269 0.0055879 -0.0133627 0.0068363 -0.0741362 0.1182262 -0.2296215 -0.0206968 -0.0888271 0.3886922 0.0407802 -0.0079809 0.0412036 -0.0631292 0.4151188 0.2180454 0.019394 0.137468 0.0847063 0.0135971 0.0116105 0.0132207 -0.0619331 0.125318 0.2120823 0.0223551 0.0768866 0.3914266 0.0472413 0.008796 0.0480103 -0.0714657 0.4122073 -0.2281757 -0.0203036 -0.0791983 0.0853195 0.0158565 -0.0053673 0.0150031 -0.0750738 0.0513698 -0.0905291 -0.007805 -0.0714339 0.0771919 -0.0065159 -0.0058046 -0.0071093 0.1503482 0.1262941 0.0773086 0.0073825 0.050624 -0.0623419 -0.0188118 0.0038388 -0.0192865 0.1491998 0.0500691 0.0927841 0.0086422 0.102166 0.0752905 -0.0071193 0.0096285 -0.0070938 0.1509607 0.1694906 -0.0346436 -0.0034225 -0.0048858 -0.0121866 -0.0165657 -0.0003481 -0.0166418 0.1517426 0.0727706 0.0210657 0.0019262 0.0265857 -0.0964811 -0.0209554 0.0026278 -0.0210701 0.1353343 -0.0365522 -0.0914562 -0.0081038 -0.0947973 0.0090053 -0.0115142 -0.0083675 -0.0114524 0.1368937 0.0706164 -0.0129327 -0.0016567 -0.0240402 -0.1126546 -0.025012 -0.0027574 -0.0249272 0.1332232 -0.0596292 0.0974208 0.0087364 0.0956884 0.0120108 -0.0120216 0.0085133 -0.0120063 0.1358197 unknown
polarizability: 291.128065|1.5470597|186.2912441|0.9779379|11.7879117|66.4926627 unknown
InChI: InChI=1S/C12H8N4S/c1-5-13-6-2-9(1)11-15-12(17-16-11)10-3-7-14-8-4-10/h1-8H
charge 0 multiplicity 1
25 atoms
S  0.755683 2.443408 0.289099
N  0.01518 -0.078465 0.031926
N  -0.992787 2.070557 0.243441
N  5.126444 -0.998646 -0.042339
N  -5.071432 -1.062422 -0.093048
C  2.492393 0.105607 0.059989
C  -2.478617 0.123024 0.040113
C  1.128387 0.642285 0.10884
C  -1.132115 0.727403 0.107692
C  2.694521 -1.296081 -0.066368
C  3.639572 0.93917 0.133803
C  -2.630426 -1.28004 -0.101391
C  -3.648301 0.922976 0.11385
C  4.013623 -1.792191 -0.112526
C  4.919481 0.347345 0.079167
C  -3.934438 -1.818438 -0.162538
C  -4.906417 0.289996 0.043546
H  1.83312 -1.966544 -0.125897
H  3.549981 2.027402 0.230449
H  -1.748512 -1.92324 -0.1610
H  -3.567217 2.008026 0.222665
H  4.202574 -2.866684 -0.209577
H  5.822448 0.964888 0.133837
H  -4.087582 -2.897864 -0.271565
H  -5.829661 0.877229 0.097431
