program: Gaussian 09
title: 000266155
version: EM64L-G09RevD.01
frameworkgroup: C1[X(C13H19NO4)]
method: RPBEPBE
basis: SDD
operation: Freq
keyword: #p
keyword: freq=noraman
keyword: PBEPBE/SDD
title: #p freq=noraman PBEPBE/SDD
converged: YES YES NO NO
title: Mulliken charges:
elementType: O O O O N C C C C C C C C C C C C C H H H H H H H H H H H H H H H H H H H
charge: -0.431719 -0.429932 -0.297550 -0.257157 -0.168368 -0.447441 -0.441462 0.467743 -0.480803 -0.325786 -0.326350 -0.363761 0.250274 -0.229124 -0.395347 0.170030 -0.259461 -0.664522 0.223120 0.246809 0.216476 0.247400 0.264761 0.223232 0.222699 0.216400 0.225790 0.222698 0.225977 0.271039 0.339069 0.337662 0.236339 0.217619 0.217214 0.253348 0.223083
chargesum: 0.00000
title: Mulliken charges with hydrogens summed into heavy atoms:
elementType: O O O O N C C C C C C C C C C C C C
charge: -0.092650 -0.092270 -0.297550 -0.257157 -0.168368 0.022489 0.022414 0.467743 -0.216042 0.120144 0.115840 -0.141063 0.250274 -0.003147 -0.124308 0.170030 0.194497 0.029124
polarizability: 2.25799290e+02 -1.62906974e+00 1.82679780e+02 7.89937432e+00 1.36860864e+01 1.01660083e+02
1716.lowfreq: -9.1542 -2.0286 -0.0002 0.0003 0.0009 4.0297 23.6366 38.6477 43.5898
frequency: 23.2897 38.5276 43.5053 51.7572 59.3725 69.6394 90.5192 106.0715 117.9965 125.2181 176.1090 194.3744 211.9286 232.8693 264.5787 286.7614 291.7303 295.9154 313.6634 321.8877 339.2913 360.0929 394.7700 426.4663 438.4868 490.7377 541.7727 566.3378 595.9996 656.5833 680.2621 724.7481 725.9193 794.6639 796.1190 801.3985 806.0011 822.6789 869.2833 874.9849 897.5530 960.6647 962.4145 972.1972 978.1048 987.3475 1010.3647 1023.3972 1029.4881 1036.0066 1054.6679 1073.1591 1095.8387 1103.3041 1127.0247 1155.5129 1180.7518 1188.4791 1224.8967 1235.8133 1279.8169 1280.6636 1292.5407 1296.1046 1301.7697 1316.0186 1344.6174 1352.3253 1357.3166 1378.2136 1379.3623 1382.8499 1391.9810 1393.5522 1446.9040 1457.5605 1463.9891 1468.5863 1476.8793 1483.4462 1485.2037 1490.2473 1503.1766 1582.7177 1606.7079 1628.9697 2979.1338 2982.3319 2985.1058 2988.4023 2992.6984 3028.7139 3048.0450 3054.7361 3085.2503 3086.6481 3086.9935 3092.4757 3117.6055 3134.3051 3160.3682 3176.5620 3189.6902 3566.1726 3566.2916
redmass: 5.2570 4.1364 6.1852 5.7751 4.0036 4.3544 4.3987 2.4062 2.3477 2.1925 4.3426 3.5391 1.3817 3.3712 2.3898 2.1544 1.6219 1.3348 3.1084 4.2018 4.8799 3.7222 2.8790 3.4125 3.4304 4.8739 4.6923 3.7010 4.3822 5.8472 2.2972 3.6444 3.8016 1.5715 1.2706 1.4225 1.2569 2.2385 3.7277 1.5697 1.4683 3.8006 4.0203 4.6837 1.3548 3.8265 2.7298 4.6282 4.0879 1.5900 3.3511 1.4363 2.1456 1.6665 1.3527 1.6787 1.5063 1.1451 2.2026 2.9007 1.1464 1.4232 1.2487 1.1651 1.1476 1.3645 1.2295 1.1948 1.2817 1.4691 1.5921 1.6283 1.2377 3.8541 2.8269 1.1407 1.0473 1.1123 1.1010 1.1176 1.0539 2.0613 1.2659 6.0441 7.7631 7.9737 1.0632 1.0647 1.0662 1.0669 1.0362 1.0590 1.0972 1.0955 1.1013 1.0983 1.1014 1.1031 1.1054 1.0867 1.0922 1.0965 1.0903 1.0664 1.0664
irintensity: 0.1148 0.8851 1.2823 2.9789 1.3247 3.3347 1.1109 8.7745 2.2097 1.7457 0.0819 1.6215 2.0840 0.3971 56.0253 4.8592 71.0953 80.7800 50.0016 40.2143 9.7055 37.1717 3.5448 1.9827 0.1928 1.6504 5.1323 0.1402 3.7635 3.2399 9.1287 23.0442 41.7959 29.1178 4.0020 6.6865 19.3835 1.4669 7.4365 13.3356 9.6572 75.2843 143.7136 7.8143 1.7537 58.0778 53.3114 19.1099 26.0603 19.1969 239.0307 26.1286 18.8295 9.7558 0.1949 38.0239 56.3954 31.1809 114.9015 202.4080 7.3908 28.2630 1.6848 6.2505 2.1468 3.5187 31.0742 28.6466 1.9209 40.5552 24.6858 7.8810 24.3864 33.2943 17.3136 40.7457 13.4495 9.1758 0.9396 25.0804 21.9759 79.6177 49.9668 62.1077 393.0410 4.8784 12.3910 29.1283 53.1950 67.0332 22.0895 37.3200 5.0296 18.1149 33.9629 35.6171 31.8744 5.0088 29.5971 13.6127 22.3310 10.8058 6.6471 10.2466 10.3687
temp: 298.150 k
press: 1.00000 atm
elementType: 8 8 8 8 7 6 6 6 6 6 6 6 6 6 6 6 6 6 1 1 1 1 1 1 1 1 1 1 1 1 1 1 1 1 1 1 1
symmnumber: 1
zpe: 798401.7 jmol-1
zpe.correction: 0.304095 hartree
zpe.thermalcorrener: 0.323742 hartree
zpe.thermalcorrenthalpy: 0.324686 hartree
zpe.thermalcorrgfe: 0.253997 hartree
zpe.sumelectzpe: -861.016702 hartree
zpe.sumelectthermal: -860.997056 hartree
zpe.sumelectthermalent: -860.996111 hartree
zpe.sumelectthermalfe: -861.066801 hartree
dipole: -0.2116 0.3516 -0.2158
dipole: 0.4636
quadrupole: -113.6470 -111.7235 -108.3078
quadrupole: 22.6266 8.5033 7.7438
quadrupole: -2.4209 -0.4974 2.9183 22.6266 8.5033 7.7438
hfenergy: -861.3207977 hartree
pointgroup: C01 [X(C13H19N1O4)]
dipole: 0.0852624 -0.144343 -0.0718603 debye
polarizability: 226.0117528|-1.6765843|179.7915214|-5.9587526|-20.3445967|104.3358783 unknown
InChI: InChI=1S/C13H19NO4/c1-2-18-13(17)11-4-3-5-12(10-11)14(6-8-15)7-9-16/h3-5,10,15-16H,2,6-9H2,1H3
charge 0 multiplicity 1
37 atoms
O  1.111186 -4.210658 0.079559
O  5.620341 0.640527 0.478456
O  -2.98791 -0.610171 0.554338
O  -3.787469 1.511406 0.000914
N  2.023662 -0.51539 0.012552
C  1.741695 -1.850682 0.567098
C  3.425608 -0.2216 -0.32892
C  1.001783 0.432423 -0.175497
C  -0.365502 0.102821 0.069494
C  1.280703 -2.87264 -0.504196
C  4.197258 0.489811 0.812977
C  1.288149 1.76324 -0.620252
C  -1.389128 1.060081 -0.114223
C  0.256205 2.704364 -0.809573
C  -1.089978 2.372973 -0.558301
C  -2.821276 0.719493 0.136013
C  -4.394302 -1.049779 0.800166
C  -5.052015 -1.521588 -0.50017
H  0.982418 -1.778398 1.3712
H  2.659291 -2.244806 1.04016
H  3.476777 0.383747 -1.255761
H  3.948418 -1.169845 -0.549514
H  -0.660716 -0.895195 0.397357
H  2.063333 -2.999232 -1.270318
H  0.354976 -2.525417 -1.005934
H  3.728252 1.464691 1.057834
H  4.188704 -0.135177 1.721057
H  2.31891 2.07417 -0.813311
H  0.514406 3.713165 -1.150484
H  -1.902212 3.09198 -0.695335
H  0.316907 -4.212502 0.671132
H  5.721274 1.311797 -0.242617
H  -4.952248 -0.208247 1.24691
H  -4.288077 -1.867308 1.531691
H  -6.060951 -1.920188 -0.284863
H  -5.157077 -0.684011 -1.209524
H  -4.458999 -2.321854 -0.976017
