program: Gaussian 09
title: 000266192
version: EM64L-G09RevD.01
frameworkgroup: C1[X(C24H26N2O4)]
method: RPBEPBE
basis: SDD
operation: Freq
keyword: #p
keyword: freq=noraman
keyword: PBEPBE/SDD
title: #p freq=noraman PBEPBE/SDD
converged: YES YES NO NO
title: Mulliken charges:
elementType: O O O O N N C C C C C C C C C C C C C C C C C C C C C C C C H H H H H H H H H H H H H H H H H H H H H H H H H H
charge: -0.299928 -0.299866 -0.283337 -0.283349 -0.464635 -0.464668 0.195735 0.195772 0.273065 0.273094 0.099488 0.099477 0.121898 0.121879 -0.050621 -0.050582 0.372103 0.372104 -0.312958 -0.313031 -0.449324 -0.449319 -0.853071 -0.853055 -0.243882 -0.243812 -0.838639 -0.838635 -0.516085 -0.516099 0.365770 0.365767 0.275757 0.275706 0.231042 0.231043 0.248152 0.241462 0.253596 0.241465 0.248157 0.253591 0.229017 0.229015 0.231057 0.232159 0.231897 0.232160 0.231060 0.231897 0.209645 0.269301 0.231309 0.209638 0.231307 0.269312
chargesum: 0.00000
title: Mulliken charges with hydrogens summed into heavy atoms:
elementType: O O O O N N C C C C C C C C C C C C C C C C C C C C C C C C
charge: -0.299928 -0.299866 -0.283337 -0.283349 -0.098866 -0.098901 0.195735 0.195772 0.273065 0.273094 0.099488 0.099477 0.121898 0.121879 -0.050621 -0.050582 0.372103 0.372104 -0.037202 -0.037325 -0.218282 -0.218275 -0.109861 -0.109842 -0.014865 -0.014797 -0.143526 -0.143519 0.194169 0.194159
polarizability: 6.74620907e+02 -2.72739695e+01 2.99481459e+02 1.49240910e+01 2.27768049e+01 1.78306842e+02
1716.lowfreq: -7.1041 -2.6571 -0.0009 -0.0007 0.0009 7.2791 12.2210 23.0175 30.8818
frequency: 12.2210 23.0175 30.7824 38.7708 42.3151 70.2403 74.4865 81.6767 88.2475 110.8822 119.4964 126.6168 130.8711 138.5945 140.5426 148.3614 156.2708 171.6872 176.9413 193.0583 193.3506 193.9636 213.4245 245.8549 246.9572 253.4594 265.9511 279.7696 303.6806 313.5211 321.0965 337.0257 339.2107 380.6146 389.7894 410.9819 422.8831 451.4290 457.2845 459.0646 500.8098 502.5073 505.4988 507.8483 512.3452 538.3704 545.5663 566.7340 567.0048 615.0720 623.5780 654.9676 681.3694 698.3733 713.1186 718.4373 730.4749 759.4184 781.2476 782.0974 796.8652 797.1771 823.8874 830.6681 842.5244 843.7713 886.3766 887.6011 896.2580 911.5333 912.2049 968.0535 968.1150 992.7963 993.1747 1001.4142 1025.1306 1025.2988 1047.1303 1050.6216 1050.6915 1059.6200 1089.1482 1097.6795 1099.7446 1104.9635 1110.0380 1110.5066 1157.3482 1160.0166 1182.2665 1184.5618 1191.9536 1196.5446 1220.9517 1240.7112 1262.5850 1263.6795 1283.2561 1298.0006 1319.9640 1331.5525 1372.5857 1372.6876 1397.2306 1397.2587 1405.1690 1405.1888 1425.0440 1425.7075 1435.7478 1436.7430 1451.6523 1451.8007 1456.8148 1457.9258 1465.9635 1468.3854 1468.6946 1472.5629 1482.4932 1483.3268 1486.6780 1486.9109 1491.6926 1491.9096 1493.7141 1496.1261 1555.7586 1564.3297 1591.5664 1592.2916 1606.9542 1607.2788 1610.4299 1628.4762 2963.2583 2963.2781 2973.6637 2973.7101 2977.0335 2977.2530 3041.7353 3041.7480 3049.8630 3049.8670 3083.9626 3083.9707 3086.6446 3086.6983 3107.2254 3107.2834 3125.7423 3125.7494 3127.2514 3127.2592 3150.7959 3150.8673 3197.0218 3197.0569 3263.1819 3269.6286
redmass: 4.7774 4.4158 4.3965 4.7886 4.1254 2.8530 3.6384 3.7935 2.4817 3.2829 3.6426 1.8392 1.6490 2.2584 1.3450 1.6204 1.7873 2.4945 3.1429 1.2184 1.1050 2.6212 4.1405 4.4050 2.9279 3.3970 3.9733 5.7214 4.3047 4.0870 5.7545 2.6643 2.9171 9.0400 4.4567 7.6969 5.0446 6.7380 5.3927 4.1176 3.9949 3.2395 3.7814 4.0830 5.8693 4.4469 4.9442 4.7128 4.6654 6.1097 8.8479 6.9846 5.5043 4.8041 3.8934 2.1931 3.3603 7.7732 1.6234 1.5811 2.9732 3.6538 1.8275 1.4105 4.8587 3.8783 1.5174 1.3693 3.9651 2.8132 2.6058 1.3385 1.3387 1.5053 1.4496 3.3184 1.4433 1.4570 5.6038 1.6255 1.6251 2.0856 2.7097 1.9485 1.8781 3.0910 1.2616 1.3931 1.4185 1.6143 1.2802 1.3758 4.2123 2.8944 2.8252 3.9711 1.8563 1.7607 3.0263 5.2908 3.1638 4.1565 5.7742 6.0408 1.2844 1.2874 1.2080 1.2074 1.2336 1.2703 2.1585 1.9912 1.0981 1.0845 1.8654 1.8620 1.9603 1.0819 1.0906 1.8218 1.3516 1.3582 1.4614 1.2352 1.0803 1.1818 1.1702 1.3088 1.9960 2.4513 6.6456 6.4463 4.2141 3.8772 9.7177 10.4586 1.0453 1.0453 1.0379 1.0379 1.0328 1.0329 1.0912 1.0912 1.0973 1.0973 1.0981 1.0981 1.0996 1.0996 1.0952 1.0951 1.0875 1.0875 1.1047 1.1047 1.0951 1.0951 1.0952 1.0952 1.0729 1.0734
irintensity: 0.4412 0.4246 0.0000 0.0000 0.0742 5.9439 0.0000 4.8661 0.0000 1.6133 0.0000 3.3896 0.0001 0.0000 0.5871 0.0000 2.8987 0.0000 0.9051 0.0118 4.0057 0.0007 1.5547 8.5572 0.0012 7.7687 0.0000 13.3368 0.0000 12.5850 0.0000 1.5194 0.0000 0.0000 9.6735 19.5516 0.0000 0.0000 0.0000 30.6227 0.0000 0.2216 0.0001 3.7580 0.0000 48.3783 0.0000 0.0049 29.1310 0.0000 3.1824 64.6551 0.0000 21.0878 31.8618 0.0000 14.7511 0.0000 0.0004 43.0314 0.0054 44.9201 0.0000 165.7825 16.3966 0.0001 0.0001 1.8920 0.0000 8.4498 0.0003 0.9902 0.0017 25.3323 0.0009 119.5035 0.0117 36.4863 59.4653 0.0310 9.0808 0.0000 61.4821 0.0019 64.2679 0.0000 16.3138 0.0041 28.1667 0.0000 0.0001 8.1132 0.0001 21.8569 0.0002 191.8160 0.0001 2.5897 0.0000 35.7734 69.3250 0.0000 30.2287 0.0667 0.1088 8.8594 29.8900 19.3671 0.0002 199.4398 0.0089 84.7211 0.0048 96.5583 0.0001 7.0134 1118.0953 0.0138 106.0849 0.0001 164.0816 0.0020 0.1400 268.5219 65.3835 0.0001 0.0012 69.3494 0.0000 44.7529 78.7961 0.0001 0.0002 3.6055 358.9297 0.0000 1.4128 36.3435 95.6252 0.0000 141.8477 0.0113 16.3073 18.9418 0.2927 37.3185 47.9193 0.0526 0.3337 55.6371 46.3393 0.2029 16.0680 4.2780 15.2007 7.7768 74.1769 0.0658 3.5032 1.8448 0.0037 174.9703
temp: 298.150 k
press: 1.00000 atm
elementType: 8 8 8 8 7 7 6 6 6 6 6 6 6 6 6 6 6 6 6 6 6 6 6 6 6 6 6 6 6 6 1 1 1 1 1 1 1 1 1 1 1 1 1 1 1 1 1 1 1 1 1 1 1 1 1 1
symmnumber: 1
zpe: 1174221.3 jmol-1
zpe.correction: 0.447237 hartree
zpe.thermalcorrener: 0.477470 hartree
zpe.thermalcorrenthalpy: 0.478414 hartree
zpe.thermalcorrgfe: 0.384851 hartree
zpe.sumelectzpe: -1338.356088 hartree
zpe.sumelectthermal: -1338.325856 hartree
zpe.sumelectthermalent: -1338.324911 hartree
zpe.sumelectthermalfe: -1338.418474 hartree
dipole: -0.0001 -0.0004 0.0003
dipole: 0.0005
quadrupole: -139.0657 -175.9668 -172.5937
quadrupole: -3.5272 -8.0113 -0.0635
quadrupole: 23.4764 -13.4247 -10.0516 -3.5272 -8.0113 -0.0635
hfenergy: -1338.8033254 hartree
pointgroup: C01 [X(C24H26N2O4)]
dipole: 0.000042 0.000138 0.0001156 debye
polarizability: 673.5753213|-33.2126433|302.4243551|-16.0671462|-16.7273875|176.4095309 unknown
InChI: InChI=1S/C24H26N2O4/c1-13-9-7-11-17(15(13)3)25-19-21(27)24(30-6)20(22(28)23(19)29-5)26-18-12-8-10-14(2)16(18)4/h7-12,25-26H,1-6H3
charge 0 multiplicity 1
56 atoms
O  1.912919 2.106799 0.467774
O  -1.912565 -2.107609 -0.469266
O  -0.918134 2.552682 0.348025
O  0.918431 -2.55344 -0.349658
N  2.716015 -0.707915 -0.073643
N  -2.715706 0.707204 0.072278
C  1.433804 -0.222959 -0.01204
C  -1.433519 0.222177 0.010629
C  3.992874 -0.102865 -0.242059
C  -3.992647 0.102336 0.240755
C  5.12667 -0.844859 0.223988
C  -5.126306 0.844319 -0.225656
C  0.983858 1.075076 0.250391
C  -0.98356 -1.07586 -0.251799
C  -0.433723 1.363263 0.210226
C  0.43402 -1.364043 -0.211672
C  6.432498 -0.327506 -0.013542
C  -6.432226 0.32723 0.011939
C  4.155504 1.122847 -0.937821
C  -4.155519 -1.123087 0.936975
C  6.578889 0.906063 -0.698149
C  -6.578853 -0.906069 0.696979
C  4.911703 -2.159849 0.957217
C  -4.911108 2.15902 -0.959342
C  5.451251 1.62352 -1.155113
C  -5.451357 -1.623505 1.154321
C  7.676577 -1.067818 0.454709
C  -7.67616 1.067544 -0.456698
C  1.704267 2.953763 1.664611
C  -1.703726 -2.95458 -1.666062
H  2.682897 -1.74531 -0.135068
H  -2.682494 1.744604 0.133599
H  3.281365 1.670811 -1.291581
H  -3.281495 -1.671022 1.291053
H  7.58572 1.300604 -0.877766
H  -7.585756 -1.300405 0.876647
H  4.132469 -2.06552 1.735861
H  4.58834 -2.969412 0.270483
H  5.833619 -2.508453 1.446505
H  -4.587838 2.968821 -0.272845
H  -4.131731 2.064355 -1.7378
H  -5.832908 2.507489 -1.448943
H  5.58182 2.569077 -1.69223
H  -5.582105 -2.568837 1.691791
H  7.707846 -1.167494 1.556742
H  7.732864 -2.089348 0.034171
H  8.588063 -0.528884 0.145573
H  -7.73232 2.089254 -0.036582
H  -7.707338 1.166772 -1.558774
H  -8.58775 0.528876 -0.147406
H  1.649308 2.32689 2.575193
H  0.786017 3.553207 1.555979
H  2.594583 3.599648 1.706172
H  -1.648656 -2.327719 -2.576645
H  -2.594017 -3.600492 -1.707739
H  -0.78547 -3.553993 -1.55729
