program: Gaussian 09
title: 000266139
version: EM64L-G09RevD.01
frameworkgroup: C1[X(C7H17ClOSi)]
method: RPBEPBE
basis: SDD
operation: Freq
keyword: #p
keyword: freq=noraman
keyword: PBEPBE/SDD
title: #p freq=noraman PBEPBE/SDD
converged: YES YES NO NO
title: Mulliken charges:
elementType: Cl Si O C C C C C C C H H H H H H H H H H H H H H H H H
charge: -0.101123 1.410545 -0.626341 0.348456 -0.880889 -1.029952 -1.041332 -0.693670 -0.707002 -0.685062 0.287507 0.284608 0.253876 0.245697 0.238460 0.245373 0.259856 0.232275 0.224311 0.206163 0.228499 0.230704 0.208265 0.217655 0.228027 0.193048 0.222048
chargesum: 0.00000
title: Mulliken charges with hydrogens summed into heavy atoms:
elementType: Cl Si O C C C C C C C
charge: -0.101123 1.410545 -0.626341 0.348456 -0.308773 -0.291919 -0.303829 -0.034698 -0.050379 -0.041939
polarizability: 1.35513894e+02 5.03252920e+00 9.99695261e+01 1.71147842e+00 -1.87333996e-01 9.98521663e+01
1716.lowfreq: -23.3451 -0.0016 0.0012 0.0018 10.8216 14.3656 35.5450 47.6634 71.1720
frequency: 32.4408 46.8654 71.0482 79.5476 140.8190 151.4738 173.2183 179.3843 180.7767 183.5258 204.7219 228.6819 244.7460 253.6565 257.8137 330.3472 334.6018 383.3694 434.6331 460.6753 554.9229 593.1904 651.1497 691.5279 724.1787 745.2080 777.8132 809.9039 862.9147 889.4327 898.6949 906.6648 910.1676 940.9075 972.3699 1019.0935 1024.0491 1073.0950 1183.2273 1189.1354 1243.3082 1253.5226 1299.2052 1307.8881 1369.1839 1371.4549 1394.4704 1413.8282 1442.5922 1444.1852 1446.7604 1451.8453 1456.6105 1462.0088 1463.6104 1473.5375 1475.1752 1490.5421 2973.1555 2980.0927 2985.2112 2987.8620 2988.7002 3052.7666 3066.5589 3076.1721 3082.7902 3086.4427 3088.3882 3092.2970 3093.1275 3095.6796 3097.7982 3098.3355 3138.2461
redmass: 3.4071 3.7638 3.4648 3.9563 1.2815 2.2412 1.0450 1.2586 2.0371 2.9730 2.9508 2.2590 1.3422 1.5690 1.2793 2.6032 2.7280 2.6169 2.8960 2.7295 4.2606 5.8055 4.9964 2.4132 1.3333 3.6825 3.1471 1.3351 1.6660 1.5235 1.6185 1.6325 1.5469 1.2047 5.1867 1.4076 1.4114 1.0397 1.7316 1.4283 3.0099 3.1117 1.2074 1.1942 1.2293 1.2424 1.2147 1.0787 1.0507 1.0530 1.0508 1.0493 1.0492 1.0493 1.0488 1.0601 1.0571 1.0522 1.0354 1.0351 1.0344 1.0356 1.0343 1.0560 1.0988 1.0991 1.1004 1.0983 1.0993 1.0984 1.0990 1.0988 1.0999 1.0983 1.1082
irintensity: 0.0520 0.0942 3.3627 3.2439 0.5567 2.3155 0.0146 0.1626 0.7465 0.4365 1.2935 4.1932 2.6277 5.7286 1.9476 6.3533 7.5633 3.9980 8.0430 4.7804 2.4186 26.1416 13.3517 5.9312 4.3580 8.2938 6.7252 14.8758 84.4105 69.1542 13.3265 19.3446 72.7805 1.2282 367.7790 1.6577 4.1478 6.7034 117.5504 45.8242 31.8327 27.0806 57.4323 36.7617 33.6015 31.8602 16.6093 11.2666 1.0151 2.8430 2.0509 12.6088 12.1276 3.9016 3.6528 3.6594 12.2339 14.9766 22.2395 23.6368 9.4073 20.1403 6.5516 8.9883 17.6538 48.8679 4.7889 18.2086 26.7001 32.2061 44.2377 11.1676 35.8701 22.8051 5.1671
temp: 298.150 k
press: 1.00000 atm
elementType: 17 14 8 6 6 6 6 6 6 6 1 1 1 1 1 1 1 1 1 1 1 1 1 1 1 1 1
symmnumber: 1
zpe: 592351.0 jmol-1
zpe.correction: 0.225615 hartree
zpe.thermalcorrener: 0.241139 hartree
zpe.thermalcorrenthalpy: 0.242083 hartree
zpe.thermalcorrgfe: 0.182871 hartree
zpe.sumelectzpe: -1100.819450 hartree
zpe.sumelectthermal: -1100.803926 hartree
zpe.sumelectthermalent: -1100.802981 hartree
zpe.sumelectthermalfe: -1100.862194 hartree
dipole: -2.7867 0.8953 0.4986
dipole: 2.9692
quadrupole: -84.0677 -76.7967 -77.5278
quadrupole: -0.0813 -0.6505 -0.2497
quadrupole: -4.6037 2.6674 1.9362 -0.0813 -0.6505 -0.2497
hfenergy: -1101.0450647 hartree
pointgroup: C01[X(C7H17Cl1O1Si1)]
dipole: -1.1105954 -0.3031966 -0.1981451 debye
polarizability: 134.8176606|-7.2392784|100.6735469|-0.117954|-0.3543424|99.8443784 unknown
InChI: InChI=1S/C7H17ClOSi/c1-7(2,3)9-10(4,5)6-8/h6H2,1-5H3
charge 0 multiplicity 1
27 atoms
Cl 4.153671 0.338922 0.10985
Si 1.096139 -0.266488 -0.013278
O  -0.338532 0.694588 0.235725
C  -1.766506 0.449723 -0.067527
C  2.415385 1.098017 0.260319
C  1.279236 -1.624397 1.307932
C  1.254097 -0.980585 -1.773118
C  -2.025243 0.780207 -1.556746
C  -2.149254 -1.015185 0.250364
C  -2.532656 1.427234 0.84699
H  2.364435 1.542093 1.266324
H  2.368034 1.894519 -0.498137
H  2.307476 -2.029987 1.293005
H  1.086668 -1.213652 2.315266
H  0.577198 -2.459644 1.135643
H  1.088578 -0.200036 -2.536863
H  2.274208 -1.384047 -1.913266
H  0.53729 -1.802248 -1.953301
H  -1.488573 0.079262 -2.220976
H  -3.104545 0.715646 -1.789287
H  -1.680124 1.805272 -1.777481
H  -1.916245 -1.255332 1.302939
H  -1.603766 -1.721942 -0.403665
H  -3.230871 -1.175685 0.088753
H  -2.206307 2.461883 0.644812
H  -3.62265 1.357931 0.67578
H  -2.32244 1.20193 1.906943
