program: Gaussian 09
title: 000266264
version: EM64L-G09RevD.01
frameworkgroup: C1[X(C24H18N6O4)]
method: RPBEPBE
basis: SDD
operation: Freq
keyword: #p
keyword: freq=noraman
keyword: PBEPBE/SDD
title: #p freq=noraman PBEPBE/SDD
converged: YES YES NO NO
title: Mulliken charges:
elementType: O O O O N N N N N N C C C C C C C C C C C C C C C C C C C C C C C C H H H H H H H H H H H H H H H H H H
charge: -0.261471 -0.261336 -0.260667 -0.260543 -0.420254 -0.420252 -0.051255 -0.051112 0.060767 0.060610 0.206868 0.206384 0.220437 0.220404 0.066859 0.066466 0.170068 0.170077 0.507618 0.507549 -0.336783 -0.337815 -0.488920 -0.488969 -0.332982 -0.333103 -0.396872 -0.396845 -0.203623 -0.203824 -0.250067 -0.249666 -0.408435 -0.408491 0.207949 0.208566 0.308090 0.307975 0.250222 0.250207 0.224520 0.224513 0.240960 0.234678 0.241119 0.234405 0.236585 0.236605 0.276791 0.276756 0.199578 0.199660
chargesum: 0.00000
title: Mulliken charges with hydrogens summed into heavy atoms:
elementType: O O O O N N N N N N C C C C C C C C C C C C C C C C C C C C C C C C
charge: -0.261471 -0.261336 -0.260667 -0.260543 -0.143464 -0.143496 -0.051255 -0.051112 0.060767 0.060610 0.206868 0.206384 0.220437 0.220404 0.066859 0.066466 0.170068 0.170077 0.507618 0.507549 -0.128834 -0.129249 -0.180831 -0.180994 -0.082760 -0.082896 -0.172352 -0.172332 0.272015 0.271699 -0.013482 -0.013061 -0.208857 -0.208831
polarizability: 7.46703673e+02 -2.87886575e-02 5.24245158e+02 2.34054020e+01 3.72929590e-02 1.35342063e+02
1716.lowfreq: -3.3600 -0.0008 -0.0002 0.0007 1.2986 2.4457 8.9503 10.6641 14.6258
frequency: 8.9496 10.6472 14.6250 23.0222 35.9190 36.1944 61.6503 71.9880 78.9548 83.4791 97.9910 108.9756 128.9027 131.5715 167.1706 171.2353 182.9434 194.2369 212.3795 215.1879 223.4659 249.9577 256.0184 310.9702 317.0412 360.6377 364.0505 376.6612 388.0454 394.8825 407.7008 433.3667 436.6828 447.3552 457.9297 466.3442 475.8781 489.2750 538.8390 543.4286 550.1360 572.4926 604.9535 605.2990 610.9341 613.4847 618.0842 643.2647 643.4650 650.8491 678.6753 678.9156 722.1047 722.3587 727.7508 753.0684 764.3368 766.9392 770.4757 775.1446 787.3494 803.5270 804.6845 805.8378 839.1481 840.8939 856.1131 871.9617 901.1941 901.3564 920.8376 921.1196 934.3850 934.4813 938.4531 943.2334 946.9583 978.7448 979.2192 985.2985 988.1977 1020.2034 1046.9229 1058.9700 1059.3605 1070.7258 1071.2708 1103.4389 1106.8964 1124.5249 1125.2644 1134.1267 1136.5191 1161.3994 1171.8176 1187.0724 1192.6908 1195.5826 1251.4572 1252.9936 1255.9773 1258.6200 1261.7226 1270.5857 1333.3351 1340.0164 1360.8423 1361.1605 1366.1992 1366.2800 1388.0037 1393.1819 1393.9737 1406.9439 1455.2046 1455.3728 1466.5382 1473.4706 1483.3260 1483.3601 1486.2239 1486.4316 1547.9508 1550.6768 1566.1063 1568.0604 1572.0310 1606.5456 1606.7406 1615.5136 1623.5411 1623.6058 2951.5556 2951.7221 3002.9860 3004.1868 3103.5836 3105.3407 3123.5962 3127.4536 3133.3725 3133.3858 3147.8636 3167.7078 3181.6308 3181.6474 3185.0769 3185.1394 3397.5830 3398.0359
redmass: 5.8206 5.2094 7.3333 7.1979 7.2170 6.1206 5.7081 2.9036 2.9063 3.0449 6.6205 5.9543 5.0734 5.8362 6.9402 3.1389 3.3619 6.0456 5.8657 7.0530 5.9146 6.2141 5.2059 7.3407 6.3537 5.4160 4.7259 6.7264 7.2719 6.7866 3.3511 3.3698 3.2059 4.3509 6.2153 6.3146 5.3786 6.2047 1.6853 1.4307 3.5589 5.9555 7.0567 6.6800 4.2078 4.4890 4.1771 5.8038 6.4529 5.6961 9.2965 9.2813 4.3917 4.3270 6.5547 7.5213 1.7392 4.3111 4.5157 5.1396 5.7701 2.1606 1.3659 2.1853 9.4418 10.0557 1.6304 6.4302 1.3696 1.3732 1.4319 1.4294 1.4781 1.4803 3.5644 3.6202 1.3936 4.3559 4.4423 6.5942 1.4168 7.4659 2.2330 3.8310 3.8808 1.4801 1.4828 4.6425 2.8796 1.0559 1.0582 1.5805 1.5052 2.2261 3.0398 1.2125 1.8593 1.9049 1.6360 1.6111 2.1233 3.5881 1.6154 2.5062 1.7445 2.6828 1.8689 1.8194 1.7033 1.6448 2.5171 3.3336 3.5306 6.5875 4.3219 4.2409 2.9572 2.3274 2.7823 2.9460 1.2783 1.3351 2.3106 2.2817 5.8070 4.6089 5.9129 7.6040 7.5802 5.6682 7.7912 7.7257 1.0861 1.0861 1.0596 1.0590 1.1124 1.1117 1.0860 1.0884 1.0897 1.0897 1.0936 1.1004 1.0950 1.0950 1.0943 1.0943 1.0737 1.0737
irintensity: 0.0377 0.6975 0.0322 4.6634 2.5020 0.0491 0.7977 3.3479 34.8002 7.5878 0.6383 0.2491 1.8566 3.6316 0.4050 47.8096 1.9463 1.6113 0.1210 11.7442 1.3541 0.0030 23.4874 3.8895 16.4903 0.9510 1.9091 1.2883 0.0045 5.5663 14.0630 0.6366 7.6013 2.2752 10.9009 18.2787 25.2481 2.1876 86.0951 10.5424 37.2865 2.9682 10.6450 5.1371 5.8284 6.1398 92.1963 22.7714 37.2771 3.1974 1.0342 0.3690 0.1790 7.5853 2.0402 52.1903 77.6459 31.0013 9.2991 10.7242 8.8864 1.2908 70.1267 0.5510 22.3671 13.4859 0.0955 19.3421 0.2532 4.5792 4.8949 81.7418 1.5120 34.6734 6.8732 4.4747 1.4113 68.0498 269.2933 3.7484 0.0363 222.5051 9.9530 0.4732 8.9974 6.9777 7.3001 81.0061 489.2900 2.5419 3.6770 0.4687 33.7002 13.8865 4.8059 11.6895 16.0358 135.5827 187.7923 96.0205 6.8353 276.5431 54.5981 42.7923 24.5427 0.3768 143.9479 281.4764 146.7551 128.9702 708.5100 5.4337 2.8657 11.7411 48.9783 180.9082 389.1451 183.0076 10.8403 34.0164 35.9883 8.4763 416.9009 78.2677 0.2618 0.3672 6.6190 23.0724 0.1803 22.8342 3.5426 21.8313 41.6689 88.4684 135.0295 167.8574 33.7982 33.9112 13.0865 1.0624 8.4657 14.0702 28.5114 31.5782 17.5552 0.0053 11.5222 5.3434 13.2583 10.0385
temp: 298.150 k
press: 1.00000 atm
elementType: 8 8 8 8 7 7 7 7 7 7 6 6 6 6 6 6 6 6 6 6 6 6 6 6 6 6 6 6 6 6 6 6 6 6 1 1 1 1 1 1 1 1 1 1 1 1 1 1 1 1 1 1
symmnumber: 1
zpe: 997152.8 jmol-1
zpe.correction: 0.379795 hartree
zpe.thermalcorrener: 0.408233 hartree
zpe.thermalcorrenthalpy: 0.409178 hartree
zpe.thermalcorrgfe: 0.314894 hartree
zpe.sumelectzpe: -1552.248674 hartree
zpe.sumelectthermal: -1552.220236 hartree
zpe.sumelectthermalent: -1552.219291 hartree
zpe.sumelectthermalfe: -1552.313575 hartree
dipole: 0.0239 6.5013 -0.0172
dipole: 6.5014
quadrupole: -160.7185 -131.3898 -201.1319
quadrupole: -0.0338 9.1646 0.0471
quadrupole: 3.6949 33.0236 -36.7185 -0.0338 9.1646 0.0471
hfenergy: -1552.628469 hartree
pointgroup: C01 [X(C24H18N6O4)]
dipole: -0.0096216 2.5578172 0.0022859 debye
polarizability: 747.1566307|0.0847969|524.2437888|16.452244|-0.7335906|134.8904738 unknown
InChI: InChI=1S/C24H18N6O4/c1-2-4-18-17(3-1)23(27-25-11-15-5-7-19-21(9-15)33-13-31-19)29-30-24(18)28-26-12-16-6-8-20-22(10-16)34-14-32-20/h1-12,27-28H,13-14H2
charge 0 multiplicity 1
52 atoms
O  -5.468403 -3.951239 0.657955
O  5.471687 -3.948388 -0.68085
O  -7.829657 -3.789434 0.263726
O  7.830401 -3.788518 -0.273851
N  -2.766804 2.087292 -0.188754
N  2.767157 2.0889 0.168783
N  -0.690558 0.965137 -0.065898
N  0.690802 0.965835 0.057987
N  -3.456697 0.904311 -0.063395
N  3.457129 0.905726 0.045304
C  -0.720096 3.442261 -0.029463
C  0.720285 3.442269 -0.004349
C  -5.815879 -2.622484 0.300791
C  5.817103 -2.620922 -0.31623
C  -1.369328 2.140476 -0.085396
C  1.369537 2.141257 0.064919
C  -7.21098 -2.53159 0.071106
C  7.211089 -2.531098 -0.079137
C  -5.57403 -0.271886 -0.148496
C  5.573688 -0.271389 0.137704
C  -1.412498 4.692068 -0.008926
C  1.413162 4.691544 -0.038162
C  -4.97026 -1.524993 0.203759
C  4.971363 -1.523393 -0.220894
C  -7.822613 -1.322833 -0.26722
C  7.821359 -1.323364 0.265194
C  -6.976613 -0.188378 -0.376145
C  6.975132 -0.188933 0.372674
C  -6.707752 -4.746307 0.480339
C  6.707821 -4.74491 -0.488628
C  -0.711118 5.903799 -0.013348
C  0.712171 5.903461 -0.046076
C  -4.758196 0.936639 -0.281137
C  4.757585 0.937082 0.269382
H  -2.507313 4.722993 0.02865
H  2.507924 4.721166 -0.07709
H  -3.89337 -1.583444 0.378891
H  3.895389 -1.581035 -0.401819
H  -8.899547 -1.257618 -0.439536
H  8.897443 -1.258823 0.44301
H  -7.418394 0.778107 -0.645466
H  7.415782 0.776705 0.646852
H  -6.902368 -5.321438 1.399068
H  -6.605671 -5.384416 -0.417116
H  6.906528 -5.328544 -1.400874
H  6.598827 -5.37459 0.414155
H  -1.255921 6.853473 0.005315
H  1.257176 6.85276 -0.075005
H  -3.270032 2.949895 -0.438143
H  3.269601 2.95114 0.421103
H  -5.289357 1.868333 -0.570852
H  5.287612 1.867838 0.564084
