program: Gaussian 09
title: 000266119
version: EM64L-G09RevD.01
frameworkgroup: C1[X(C6H12O4S)]
method: RPBEPBE
basis: SDD
operation: Freq
keyword: #p
keyword: freq=noraman
keyword: PBEPBE/SDD
title: #p freq=noraman PBEPBE/SDD
converged: YES YES NO NO
title: Mulliken charges:
elementType: S O O O O C C C C C C H H H H H H H H H H H H
charge: 1.041651 -0.275665 -0.400798 -0.508248 -0.522805 -0.018130 -0.477765 -0.479425 -0.291922 -0.357926 -0.723560 0.240115 0.270583 0.224180 0.235912 0.239084 0.204326 0.219588 0.258791 0.256140 0.288297 0.284073 0.293506
chargesum: 0.00000
title: Mulliken charges with hydrogens summed into heavy atoms:
elementType: S O O O O C C C C C C
charge: 1.041651 -0.275665 -0.400798 -0.508248 -0.522805 0.221985 0.016998 -0.004430 0.131992 0.157006 0.142316
polarizability: 1.28888241e+02 -5.88232852e-01 9.31183958e+01 4.59273543e+00 -1.51418913e+00 8.82147967e+01
1716.lowfreq: -22.8226 -12.2203 -7.1540 -0.0009 0.0011 0.0014 20.7177 28.3938 72.9698
frequency: 19.5429 26.6170 72.9644 89.3502 148.2836 159.4609 192.7478 201.1260 235.5669 241.5847 278.8454 331.9635 354.3063 394.8122 438.1241 496.3802 588.9115 603.0619 686.0601 808.6692 820.8575 831.8631 851.3380 885.8963 894.8807 909.4716 914.2790 982.5689 991.3456 997.1646 1021.8712 1037.5116 1078.6310 1126.7598 1144.1060 1170.5039 1211.7701 1230.1211 1258.3347 1303.7373 1316.7160 1318.9476 1324.7218 1336.3354 1360.2760 1415.4670 1416.8943 1441.6700 1473.0073 1479.3304 1490.8607 2984.5694 2985.2396 3012.9745 3016.7059 3040.3838 3043.4643 3060.8009 3067.4465 3079.9144 3093.6732 3188.6334 3197.9573
redmass: 3.7157 4.7006 6.4843 3.1704 2.9552 1.1056 3.4624 4.9467 2.8117 3.1223 7.7582 8.6120 5.2337 2.9590 3.3317 7.3522 1.9761 8.5341 5.1818 2.4078 2.6880 11.6075 2.2776 1.7019 5.6758 3.0605 2.7710 1.7766 1.9786 1.4177 3.3861 1.8783 1.5577 1.5113 1.3378 1.6970 1.2126 1.3184 1.2380 1.3563 1.2542 1.1397 1.2938 1.3001 1.3869 1.0516 1.0504 1.0808 1.0862 1.0869 1.0953 1.0612 1.0627 1.0638 1.0634 1.0248 1.0874 1.1014 1.1020 1.1015 1.1054 1.1078 1.1077
irintensity: 2.3325 7.3271 1.9583 2.1738 4.3895 0.2260 0.3847 5.3251 5.4609 5.9196 12.7369 47.5193 8.9875 6.4796 28.2773 41.8512 9.0913 55.1278 2.3730 5.2963 17.3704 44.8229 2.7782 12.1555 117.1778 36.2235 4.7770 15.6278 13.2352 23.3844 73.2825 58.7574 6.2899 1.9535 3.0129 2.4008 3.8393 4.1187 0.9162 7.8999 1.5447 1.2623 6.8509 11.2014 4.8946 13.3092 13.0496 19.3017 15.0377 9.9471 2.5428 15.6479 80.6614 16.6201 16.5018 0.1627 33.9860 33.1663 16.3385 7.7420 43.8250 0.1676 0.0117
temp: 298.150 k
press: 1.00000 atm
elementType: 16 8 8 8 8 6 6 6 6 6 6 1 1 1 1 1 1 1 1 1 1 1 1
symmnumber: 1
zpe: 473585.9 jmol-1
zpe.correction: 0.180379 hartree
zpe.thermalcorrener: 0.193302 hartree
zpe.thermalcorrenthalpy: 0.194247 hartree
zpe.thermalcorrgfe: 0.139121 hartree
zpe.sumelectzpe: -933.701530 hartree
zpe.sumelectthermal: -933.688607 hartree
zpe.sumelectthermalent: -933.687663 hartree
zpe.sumelectthermalfe: -933.742788 hartree
dipole: -2.0947 -1.1221 -0.0830
dipole: 2.3778
quadrupole: -58.8389 -78.5418 -78.2350
quadrupole: 13.0668 0.4128 0.0198
quadrupole: 13.0330 -6.6699 -6.3631 13.0668 0.4128 0.0198
hfenergy: -933.8819092 hartree
pointgroup: C01 [X(C6H12O4S1)]
dipole: -0.8746503 0.2989383 0.144153 debye
dipolederiv: 1.57799 0.116665 -0.0405376 0.2928792 1.4075522 -0.0970732 0.0858027 0.0166565 1.2051266 -0.9101275 0.0127988 0.1779373 0.1573922 -0.4622389 -0.0362173 0.2555535 -0.0356855 -0.460293 -0.9941632 -0.2113426 0.0581491 -0.2900625 -0.5812359 0.0132231 0.1310133 -0.0250946 -0.4132946 -0.6585884 -0.0017266 0.0332941 -0.0339562 -0.6134005 0.1072572 0.0060167 0.1544879 -0.5667902 -0.6078896 -0.0149699 -0.0193459 -0.04868 -0.4951204 -0.0141713 -0.043608 -0.1063413 -0.6110261 0.6007943 0.0248097 -0.110273 0.0432203 0.2121073 0.010477 -0.0003966 0.1257151 0.3234719 -0.0037651 -0.0111511 0.0979514 0.0030306 -0.1213191 0.0515256 0.0416394 0.0070801 0.0321314 0.0349222 -0.0288774 0.088414 -0.0111148 -0.0410302 -0.0353367 0.086665 0.0318097 -0.0166685 0.5278036 -0.0864849 -0.0868151 -0.387 0.2937157 0.1323017 -0.1423877 0.0150434 0.3728423 0.7254457 0.2219325 -0.0785534 -0.0324814 0.1134603 0.0090456 -0.2790991 -0.121994 0.1444105 -0.1366303 0.0170893 0.0140673 -0.0022441 -0.0926084 0.0124334 -0.0012942 -0.0020555 -0.0939673 0.0152876 0.0132148 0.0158853 0.0280139 -0.0215924 -0.1014283 -0.0007815 -0.0959605 -0.0956279 0.044235 -0.0823067 0.0609791 -0.065416 0.0473075 0.0214651 0.0302933 0.0200136 0.0548807 -0.0579957 0.0412028 -0.1308122 0.0308343 0.0666472 -0.0123145 -0.0948764 -0.0001966 -0.0688293 0.0012644 0.118748 0.0037878 0.1164545 -0.0791531 -0.0043633 -0.0193566 0.0133733 0.1004656 -0.018788 -0.0697995 -0.1066534 -0.0403402 0.062903 -0.0006305 -0.0964515 -0.0228584 -0.0379277 -0.2377135 0.0129653 -0.0324554 0.0909978 0.0323734 -0.0259206 -0.1097723 -0.0075901 0.0202607 0.0389409 0.0169018 0.0251472 0.0202817 0.052628 0.019302 0.1144538 0.0180991 -0.1789997 0.0418455 -0.0483036 -0.0066834 0.0269907 0.0835722 -0.1072028 0.0318527 -0.0416767 -0.0013969 -0.0696755 -0.0456169 0.0204954 0.0624101 -0.0526429 0.0598939 -0.0143456 0.0535348 0.0981788 0.0414418 0.0279556 0.0071268 0.0292069 0.0628312 0.0569777 0.0259238 0.0531953 0.0453985 -0.0037828 -0.0414027 0.0120238 -0.0101612 0.025453 -0.016922 0.0168243 -0.008881 0.1216579 0.0491484 0.0176985 -0.0031293 0.0197438 0.0997908 -0.0423219 -0.0236688 -0.0406747 0.0259962 unknown
polarizability: 125.5119955|5.7342|94.0189426|-10.1214991|-3.4848632|90.6904953 unknown
InChI: InChI=1S/C6H12O4S/c1-11(7,8)10-5-6-3-2-4-9-6/h6H,2-5H2,1H3
charge 0 multiplicity 1
23 atoms
S  -1.736655 -0.653143 0.366053
O  2.697331 1.458697 -0.35264
O  -0.898052 1.005766 0.645788
O  -1.311916 -1.719289 1.508504
O  -1.560838 -1.043803 -1.199871
C  1.616358 0.963653 0.547588
C  1.945645 -0.519974 0.817369
C  2.62693 -0.966408 -0.502671
C  3.445738 0.283626 -0.889715
C  0.29659 1.221859 -0.207463
C  -3.479436 -0.002866 0.719948
H  1.641826 1.577656 1.464781
H  1.061243 -1.123731 1.082448
H  2.662898 -0.587745 1.655619
H  3.26276 -1.857333 -0.367972
H  1.868759 -1.200816 -1.27156
H  4.449081 0.273525 -0.420446
H  3.554661 0.42492 -1.979078
H  0.224884 0.605942 -1.126674
H  0.234341 2.285776 -0.499141
H  -3.684578 0.747292 -0.053822
H  -4.148257 -0.87276 0.664102
H  -3.435214 0.433553 1.726356
