program: Gaussian 09
title: 000266108
version: EM64L-G09RevD.01
frameworkgroup: C1[X(C6H4N4O2)]
method: RPBEPBE
basis: SDD
operation: Freq
keyword: #pfreq=noraman
keyword: PBEPBE/SDD
title: #p freq=noraman PBEPBE/SDD
converged: NO NO NO NO
title: Mulliken charges:
elementType: O O N N N N C C C C C C H H H H
charge: -0.191623 -0.204762 -0.221926 -0.103835 0.036690 -0.088064 0.204783 -0.283614 0.343546 -0.226551 -0.252568 -0.183917 0.315484 0.274311 0.299225 0.282822
chargesum: 0.00000
title: Mulliken charges with hydrogens summed into heavy atoms:
elementType: O O N N N N C C C C C C
charge: -0.191623 -0.204762 -0.221926 -0.103835 0.036690 -0.088064 0.204783 0.031870 0.343546 0.047760 0.046656 0.098905
polarizability: 1.62046567e+02 -9.05763156e+00 1.08400584e+02 -7.18712176e-03 -3.18902409e-03 3.82859892e+01
1716.lowfreq: -0.0006 -0.0003 0.0003 3.8060 6.2465 8.2715 62.8204 109.9373 193.7798
frequency: 62.8198 109.9364 193.7797 220.2267 293.2156 341.7653 387.6586 419.8500 515.9741 553.4476 576.3679 631.2432 671.5300 688.4145 728.1909 749.1876 763.2072 793.9550 828.3965 898.1111 900.2837 927.4958 941.9887 982.0245 1065.3942 1119.3378 1159.9327 1196.6520 1226.2746 1249.0079 1280.4779 1326.2150 1365.7762 1388.7436 1424.7200 1500.7994 1535.2899 1628.1021 3188.7844 3198.2583 3206.0170 3257.0812
redmass: 10.8865 9.9945 9.2450 4.7557 6.7458 13.0023 6.9233 2.9618 6.6897 4.3080 7.3109 5.6280 8.2808 4.1434 2.5595 7.2952 2.0862 6.6866 1.5199 1.4947 6.6975 4.7610 9.1864 1.2847 2.5435 1.4232 1.9212 5.4639 7.2354 1.9561 2.2040 2.5355 6.8067 3.5936 7.8481 4.5662 8.1627 7.6277 1.0890 1.0947 1.0987 1.0999
irintensity: 0.0464 15.6901 8.0954 1.2497 1.8176 0.4760 1.8664 11.5751 4.1753 0.0157 2.7648 8.8302 16.4532 7.1442 30.5496 3.8966 14.5374 9.4784 37.2679 30.0012 5.1478 8.3573 8.4244 0.7540 29.5835 42.0831 71.9064 22.4772 327.8813 5.9603 12.3469 2.8962 86.4993 37.2263 37.5073 1.5569 0.5064 47.5933 5.2966 8.9762 2.0525 2.2914
temp: 298.150 k
press: 1.00000 atm
elementType: 8 8 7 7 7 7 6 6 6 6 6 6 1 1 1 1
symmnumber: 1
zpe: 272126.1 jmol-1
zpe.correction: 0.103647 hartree
zpe.thermalcorrener: 0.112328 hartree
zpe.thermalcorrenthalpy: 0.113272 hartree
zpe.thermalcorrgfe: 0.069143 hartree
zpe.sumelectzpe: -599.524628 hartree
zpe.sumelectthermal: -599.515947 hartree
zpe.sumelectthermalent: -599.515003 hartree
zpe.sumelectthermalfe: -599.559132 hartree
dipole: -0.7088 -0.7117 0.0042
dipole: 1.0045
quadrupole: -104.0842 -59.0338 -68.0529
quadrupole: -6.8274 0.0177 -0.0036
quadrupole: -27.0272 18.0232 9.0041 -6.8274 0.0177 -0.0036
hfenergy: -599.6282755 hartree
pointgroup: C01 [X(C6H4N4O2)]
dipole: 0.2812967 -0.2775688 -0.0016503 debye
dipolederiv: -0.7635714 -0.2112374 -0.0000473 -0.1759757 -0.5998291 -0.0000986 0.0006636 0.0000855 -0.2173727 -0.6790339 0.1407846 -0.0000223 0.3168016 -0.7005367 0.0001011 0.0002526 -0.0001708 -0.223233 -0.8093106 0.0374388 0.0010508 0.5060756 -0.201025 0.0003062 -0.0000204 0.0004007 0.0651654 -0.6048249 -0.3280147 0.0003195 -0.1113231 -0.2196477 -0.0009097 0.0030902 0.0007062 -0.2181574 1.9092219 0.036606 0.0000011 -0.2024992 1.082008 0.0000927 -0.0010377 0.0001359 0.1942495 -0.1615751 0.0504376 -0.0016091 0.1313033 0.093709 0.0000973 -0.0037144 -0.0001313 -0.2282838 0.6331427 0.0814025 0.0006449 -0.4448204 -0.0141361 0.0002089 -0.0008614 0.0001908 0.0944163 0.6636989 0.0598958 -0.0004557 0.1658157 -0.0138616 -0.0000175 0.0001667 0.0003962 0.0013521 -0.816596 -0.0644099 0.0002198 -0.065596 0.0602936 0.0001173 -0.0008906 -0.000472 0.0236302 -0.1395828 -0.0744385 -0.0001862 0.0001332 0.1386384 -0.000069 0.0002497 -0.0000366 -0.0788494 0.0184985 0.0892119 0.0000967 -0.246436 -0.0140408 -0.0002042 -0.000475 0.0000504 -0.115693 0.3296221 0.1545762 -0.0001791 0.0879436 0.0975558 0.0004352 0.0007883 -0.0019932 -0.0583094 0.1106684 -0.0035376 -0.0000218 0.0032224 0.0995351 -0.0000099 0.0008997 0.0000211 0.2005884 0.0855363 0.0374576 -0.0000141 0.0134364 0.0342983 0.0000539 0.0003182 0.0000865 0.1684098 0.1073218 -0.0659155 0.0000238 -0.0037428 0.1014552 0.000018 0.0000092 -0.0000165 0.1801503 0.116784 0.0597425 0.000179 0.0256614 0.0555835 -0.0001217 0.0005612 0.0007469 0.2119369 unknown
polarizability: 161.8844602|9.5242226|108.5626914|-0.0072147|0.0031262|38.2859892 unknown
InChI: InChI=1S/C6H4N4O2/c11-10(12)5-1-2-6-8-7-4-9(6)3-5/h1-4H
charge 0 multiplicity 1
16 atoms
O  3.49228 0.733256 0.000222
O  2.9919 -1.496517 0.000222
N  -1.035749 -0.649177 0.000123
N  -2.8664 0.721863 -0.000742
N  2.655571 -0.248362 0.00062
N  -3.290462 -0.633216 0.003361
C  -1.50608 0.710934 -0.000116
C  0.307988 -0.966515 0.000711
C  1.215675 0.083894 0.000628
C  -0.547927 1.768762 -0.000325
C  0.807393 1.463922 0.000042
C  -2.198356 -1.426871 -0.00151
H  0.619554 -2.012419 0.000673
H  -0.913071 2.797783 -0.000888
H  1.576322 2.239019 -0.000306
H  -2.209039 -2.512858 -0.001616
