program: Gaussian 09
title: 000266121
version: EM64L-G09RevD.01
frameworkgroup: C1[X(C12H8ClNO5S)]
method: RPBEPBE
basis: SDD
operation: Freq
keyword: #p
keyword: freq=noraman
keyword: PBEPBE/SDD
title: #p freq=noraman PBEPBE/SDD
converged: YES YES NO NO
title: Mulliken charges:
elementType: Cl S O O O O O N C C C C C C C C C C C C H H H H H H H H
charge: 0.064349 0.958041 -0.391535 -0.489740 -0.484858 -0.180759 -0.161922 0.007948 -0.047435 -0.338218 -0.231847 0.554200 -0.159664 -0.321025 0.323943 -0.316479 -0.326201 -0.184983 -0.183841 -0.223799 0.327134 0.297044 0.278678 0.259261 0.257802 0.238437 0.237575 0.237895
chargesum: 0.00000
title: Mulliken charges with hydrogens summed into heavy atoms:
elementType: Cl S O O O O O N C C C C C C C C C C C C
charge: 0.064349 0.958041 -0.391535 -0.489740 -0.484858 -0.180759 -0.161922 0.007948 -0.047435 -0.011084 0.065197 0.554200 0.119014 -0.321025 0.323943 -0.057217 -0.068399 0.053454 0.053734 0.014096
polarizability: 3.72746367e+02 -1.90356596e+01 1.95795252e+02 1.99296618e+01 5.83758082e+00 1.17045983e+02
1716.lowfreq: -5.4649 -2.8321 0.0009 0.0020 0.0025 0.7587 7.6714 17.7785 25.5175
frequency: 4.6474 17.3395 25.5074 39.4284 45.1374 72.5034 94.8855 107.1752 142.8661 159.2858 170.3407 189.2382 210.7155 248.3164 278.1586 322.1266 338.4264 368.7910 392.7142 397.0518 411.2739 415.5969 422.3024 475.4440 505.3823 526.7776 560.6291 586.1465 604.9410 642.5359 675.4979 678.3554 707.5205 732.8710 782.3548 805.8747 812.2102 825.7057 833.9795 836.8369 926.3162 932.5197 942.7698 976.3150 978.3141 984.9886 998.8320 1013.1992 1017.7819 1069.8928 1074.3074 1111.5536 1145.1917 1147.6295 1173.1716 1195.9706 1205.3139 1245.3041 1301.1515 1362.0096 1381.2929 1381.5242 1397.8331 1437.1008 1439.6386 1454.7387 1567.5219 1570.4730 1585.3287 1585.8813 3136.2507 3147.2724 3160.0757 3164.8377 3169.7989 3171.5514 3178.8537 3183.1694
redmass: 6.9063 4.9668 10.0310 6.8169 15.9383 8.4207 8.3655 9.3855 6.8509 6.6711 9.7761 15.8573 14.6315 14.1320 8.7945 7.3762 10.6899 8.3018 4.4129 8.4894 9.4903 4.0148 4.1490 6.3591 5.1204 5.8043 5.1372 6.5666 6.5907 7.8132 6.0883 1.7837 9.9324 5.0616 2.0477 9.6878 4.9350 11.4729 1.2500 1.3512 1.4959 1.4776 15.6487 1.3618 1.3823 6.1171 1.3433 2.1092 8.3747 2.2819 1.5193 3.2419 1.3749 1.8151 1.0625 1.8568 12.6172 1.3093 1.3840 3.7796 8.0306 9.3054 6.9223 2.3467 2.5344 2.0964 5.7533 7.4328 5.9136 8.0773 1.0856 1.0893 1.0934 1.0898 1.0927 1.0967 1.1008 1.0973
irintensity: 0.8037 0.5060 0.6549 0.1087 0.5302 7.2081 2.1640 2.6604 2.1389 25.5343 2.1530 0.3534 3.2501 1.2439 1.7080 16.2927 7.3684 27.6350 6.5880 48.6323 64.5626 6.1570 9.8592 6.5522 42.3056 31.6594 18.6107 2.1006 0.1167 15.3200 0.8287 40.1886 20.0850 3.6562 30.5599 40.0043 15.3903 105.7236 0.3625 15.4976 17.8061 5.9016 52.5176 0.5806 0.0574 4.5948 0.3808 5.7898 98.2843 24.2776 11.3743 10.8927 19.9244 30.2268 0.1009 2.1718 211.3250 15.6005 0.0023 9.3185 11.7260 23.6852 61.7052 10.5600 96.9694 4.4077 2.7703 16.9189 36.4747 17.1011 0.4791 9.0237 19.8299 4.7276 16.7734 9.0312 21.2750 2.5605
temp: 298.150 k
press: 1.00000 atm
elementType: 17 16 8 8 8 8 8 7 6 6 6 6 6 6 6 6 6 6 6 6 1 1 1 1 1 1 1 1
symmnumber: 1
zpe: 468831.9 jmol-1
zpe.correction: 0.178569 hartree
zpe.thermalcorrener: 0.197497 hartree
zpe.thermalcorrenthalpy: 0.198442 hartree
zpe.thermalcorrgfe: 0.125643 hartree
zpe.sumelectzpe: -1749.369252 hartree
zpe.sumelectthermal: -1749.350323 hartree
zpe.sumelectthermalent: -1749.349379 hartree
zpe.sumelectthermalfe: -1749.422178 hartree
dipole: -2.7608 -2.9083 -2.8346
dipole: 4.9107
quadrupole: -117.1087 -127.5282 -138.2602
quadrupole: -18.3032 6.2548 4.8384
quadrupole: 10.5236 0.1042 -10.6278 -18.3032 6.2548 4.8384
hfenergy: -1749.5478207 hartree
pointgroup: C01 [X(C12H8Cl1N1O5S1)]
dipole: -1.076462 0.5108235 1.5208648 debye
polarizability: 373.3315433|23.6822597|173.469251|-8.9165046|35.7221217|138.7868076 unknown
InChI: InChI=1S/C12H8ClNO5S/c13-11-7-6-10(8-12(11)14(15)16)20(17,18)19-9-4-2-1-3-5-9/h1-8H
charge 0 multiplicity 1
28 atoms
Cl 5.234424 0.298365 1.32715
S  -0.803009 1.234739 -0.772438
O  -1.629427 -0.003803 0.608424
O  -1.193127 2.783957 -0.466789
O  -0.98274 0.60003 -2.258388
O  3.019821 -2.459196 -1.336956
O  5.001797 -1.346706 -1.118875
N  3.73204 -1.45242 -0.95615
C  0.958625 0.94445 -0.190918
C  1.667882 -0.127378 -0.737893
C  1.494242 1.816687 0.771509
C  3.002259 -0.321806 -0.315262
C  2.817132 1.593072 1.201437
C  3.576841 0.528899 0.664182
C  -2.990234 -0.227435 0.481745
C  -3.457389 -1.294095 -0.340067
C  -3.907692 0.58121 1.213686
C  -4.837495 -1.56893 -0.39535
C  -5.284447 0.293203 1.150148
C  -5.751279 -0.778745 0.347077
H  1.229527 -0.79767 -1.483664
H  0.900805 2.648034 1.163818
H  3.267365 2.238129 1.96067
H  -2.73033 -1.884467 -0.906491
H  -3.51933 1.405622 1.820113
H  -5.205518 -2.391771 -1.017117
H  -5.996388 0.901454 1.717972
H  -6.824153 -0.994331 0.296428
