program: Gaussian 09
title: 000266114
version: EM64L-G09RevD.01
frameworkgroup: C1[X(C8H14ClNO4)]
method: RPBEPBE
basis: SDD
operation: Freq
keyword: #p
keyword: freq=noraman
keyword: PBEPBE/SDD
title: #p freq=noraman PBEPBE/SDD
converged: YES YES NO NO
title: Mulliken charges:
elementType: Cl O O O O N C C C C C C C C H H H H H H H H H H H H H H
charge: -0.070340 -0.463878 -0.378463 -0.245359 -0.256732 -0.362214 -0.110883 -0.178256 -0.362252 -0.359630 0.172129 -0.698932 0.307072 -0.671444 0.210370 0.296738 0.199225 0.211698 0.239420 0.185415 0.344733 0.214001 0.207467 0.218898 0.371681 0.295692 0.296798 0.387046
chargesum: 0.00000
title: Mulliken charges with hydrogens summed into heavy atoms:
elementType: Cl O O O O N C C C C C C C C
charge: -0.070340 -0.092197 0.008582 -0.245359 -0.256732 -0.017481 0.099488 0.118481 0.048671 0.065205 0.172129 -0.058565 0.307072 -0.078954
polarizability: 1.16061745e+02 2.98081355e+00 1.17020938e+02 -7.92766419e+00 -1.53711704e+00 1.13496718e+02
1716.lowfreq: -17.4148 -7.2189 -0.0003 0.0008 0.0020 3.1704 18.9925 27.4171 39.4459
frequency: 18.7983 27.2587 39.2210 58.9861 66.4706 87.8389 93.9168 101.3709 130.4594 191.4884 225.2863 231.7875 252.9677 284.8024 308.5405 334.4859 357.9821 383.0084 492.4970 543.2446 555.1977 580.8997 608.2249 627.2290 671.9707 704.7154 719.2945 739.1412 749.5303 829.5394 862.7028 894.9415 907.9109 919.8175 966.5194 991.4943 1032.6114 1061.6943 1076.6916 1092.1682 1116.6610 1136.1722 1154.1109 1214.9148 1226.1333 1248.4167 1258.1662 1267.5702 1276.0402 1291.1690 1298.3890 1324.3309 1351.9689 1357.3327 1386.3453 1393.5733 1418.5015 1451.7406 1474.9476 1478.8270 1486.1340 1487.8402 1604.0367 1628.5441 2962.2317 2971.6834 2973.6577 2979.7717 3029.0354 3032.0373 3049.4983 3070.5940 3073.9377 3074.0957 3151.7315 3481.1826 3483.6814 3498.6256
redmass: 8.4980 7.7596 5.6014 1.7345 4.2409 5.3829 3.2125 5.4083 3.8208 4.7743 4.9073 1.1504 6.8582 4.4650 4.9850 5.5095 4.0104 9.2850 2.8463 3.7107 2.7975 1.0852 2.9560 1.5882 5.4688 2.1511 2.9964 1.2238 2.0337 1.8841 3.6835 1.8649 1.7394 2.1966 4.8750 2.3106 2.7786 2.2414 2.0948 2.6113 1.7773 3.1107 1.1137 1.4289 1.4930 1.3601 1.1965 1.3434 1.3073 1.5097 1.1157 1.4128 1.4751 1.8131 1.5204 1.3368 1.0917 1.0852 1.0531 1.0432 1.0907 2.1133 9.8288 8.0401 1.0842 1.0507 1.0489 1.0617 1.0904 1.0876 1.1009 1.0567 1.0994 1.1008 1.1090 1.0722 1.0703 1.0640
irintensity: 1.3031 0.1843 0.5350 0.7412 0.8144 3.7353 14.9241 1.5418 3.3591 4.8011 10.7310 1.1263 5.0319 5.8093 3.3081 7.5643 1.7866 6.7506 17.3138 20.7411 51.4363 161.8082 50.1284 75.0842 58.7991 100.1984 60.6806 19.0806 91.9391 22.3938 7.0740 6.5897 10.0741 4.7070 1.6820 27.9704 19.9636 106.4585 137.8927 8.1252 5.5165 12.7779 0.3469 13.5924 2.3944 3.6611 20.1799 20.8844 44.8516 35.7365 8.3779 12.3090 12.0380 32.2398 35.9196 18.4372 38.3606 2.9290 3.6843 12.3416 3.3482 223.6920 252.5034 198.7158 29.1407 32.6310 19.0617 45.9707 1.8909 23.9991 6.0374 3.3787 54.2164 77.5175 0.8023 57.9301 56.8119 18.6189
temp: 298.150 k
press: 1.00000 atm
elementType: 17 8 8 8 8 7 6 6 6 6 6 6 6 6 1 1 1 1 1 1 1 1 1 1 1 1 1 1
symmnumber: 1
zpe: 580107.1 jmol-1
zpe.correction: 0.220951 hartree
zpe.thermalcorrener: 0.237310 hartree
zpe.thermalcorrenthalpy: 0.238254 hartree
zpe.thermalcorrgfe: 0.173712 hartree
zpe.sumelectzpe: -1127.861301 hartree
zpe.sumelectthermal: -1127.844942 hartree
zpe.sumelectthermalent: -1127.843998 hartree
zpe.sumelectthermalfe: -1127.908541 hartree
dipole: -0.0918 1.4047 0.2706
dipole: 1.4335
quadrupole: -86.5616 -83.2632 -102.9970
quadrupole: -2.9170 4.7002 -0.9325
quadrupole: 4.3790 7.6774 -12.0564 -2.9170 4.7002 -0.9325
hfenergy: -1128.0822521 hartree
pointgroup: C01 [X(C8H14Cl1N1O4)]
dipole: -0.0974104 0.5116896 0.2161938 debye
polarizability: 116.0010797|4.4479767|118.3531477|-6.8481289|-1.085097|112.2251738 unknown
InChI: InChI=1S/C8H14ClNO4/c1-2-3-5(11)7(8(13)14)10-6(12)4-9/h5,7,10-11,13H,2-4H2,1H3
charge 0 multiplicity 1
28 atoms
Cl -2.136235 -2.172049 -2.055158
O  1.487517 0.882602 -1.542956
O  -1.660279 2.406246 1.001398
O  -0.104642 3.027743 -0.5979
O  -1.565177 -1.133468 1.842173
N  -0.77513 -0.232409 -0.164504
C  1.51874 0.727502 -0.076628
C  0.066401 0.787633 0.472235
C  2.211404 -0.606822 0.229651
C  3.704768 -0.603202 -0.165557
C  -0.540073 2.177754 0.219774
C  4.379101 -1.969708 0.077319
C  -1.509698 -1.126105 0.574075
C  -2.320352 -2.186648 -0.169892
H  2.089551 1.564226 0.382453
H  0.038523 0.590329 1.560373
H  2.108145 -0.829557 1.311153
H  1.686831 -1.41263 -0.319499
H  3.785834 -0.322968 -1.231902
H  4.236311 0.180705 0.412528
H  -0.702243 -0.336523 -1.183443
H  3.890335 -2.763296 -0.518661
H  4.319402 -2.264366 1.142363
H  5.44698 -1.945491 -0.206661
H  1.20758 1.820273 -1.729818
H  -2.007021 -3.187262 0.160902
H  -3.391326 -2.040072 0.033303
H  -2.052547 3.297561 0.788781
