program: Gaussian 09
title: 000266109
version: EM64L-G09RevD.01
frameworkgroup: C1[X(C13H15N)]
method: RPBEPBE
basis: SDD
operation: Freq
keyword: #pfreq=noraman
keyword: PBEPBE/SDD
title: #p freq=noraman PBEPBE/SDD
converged: YES YES NO NO
title: Mulliken charges:
elementType: N C C C C C C C C C C C C C H H H H H H H H H H H H H H H
charge: -0.478332 0.129962 0.191245 -0.507891 -0.503062 -0.411959 -0.399062 0.146047 0.206427 -0.622648 -0.366611 0.462634 -0.355322 -0.830370 0.212955 0.216492 0.222646 0.216392 0.203462 0.206106 0.204652 0.211535 0.293345 0.234900 0.224903 0.222489 0.221350 0.223850 0.223864
chargesum: 0.00000
title: Mulliken charges with hydrogens summed into heavy atoms:
elementType: N C C C C C C C C C C C C C
charge: -0.184987 0.129962 0.191245 -0.078445 -0.064024 -0.002391 0.017126 0.146047 0.206427 -0.387748 -0.141708 0.462634 -0.132833 -0.161305
polarizability: 2.13935248e+02 5.86562638e+00 1.45994431e+02 -3.96731614e-01 -1.14102590e+00 8.03606202e+01
1716.lowfreq: 0.0004 0.0005 0.0007 6.3401 10.7045 14.4552 59.7895 75.1682 106.1440
frequency: 59.7744 75.1539 106.1385 164.8984 175.0533 199.0694 289.1123 314.2503 324.3112 355.8638 367.2808 430.5986 444.2093 482.8803 492.1031 511.3259 570.7593 592.4822 639.3700 669.3585 694.2861 757.3918 793.1977 796.6780 821.2002 825.1942 861.6989 883.8584 908.6238 913.7296 931.2503 965.8970 978.2711 1015.3336 1046.6287 1078.2306 1089.1915 1130.1480 1131.2903 1140.8648 1150.8074 1202.8829 1213.3089 1235.5257 1238.7127 1253.9718 1283.5379 1301.4056 1331.1313 1335.9668 1339.2366 1359.9753 1396.9714 1406.3759 1441.8107 1458.1740 1460.5828 1465.1638 1467.0008 1470.5365 1474.8977 1476.6801 1495.1476 1581.4155 1602.3154 1638.5865 2947.8925 2951.1000 2968.7113 2976.8363 2981.2077 3000.7510 3006.4440 3040.3599 3044.2907 3049.7248 3076.8986 3113.6006 3121.3215 3139.2697 3605.8691
redmass: 1.0932 2.8238 2.7098 3.6551 2.7248 3.1183 1.8508 3.2056 2.8930 3.4648 4.6528 2.8664 3.2186 1.3178 2.6303 3.4292 4.1396 2.9743 4.0949 2.9675 4.3422 3.9961 4.3783 1.4159 2.4674 1.9245 2.5603 1.4011 1.4844 2.9674 1.3349 2.2005 1.7842 1.9751 1.5220 1.8154 1.9515 1.6400 1.4323 1.6481 1.4309 1.8431 1.6466 1.3159 2.2089 1.2739 1.6821 1.7887 1.9107 1.4626 1.4074 2.0408 1.2423 3.9040 2.3465 1.2203 1.5824 1.2446 1.2246 1.0463 1.2017 2.6030 1.8352 6.5211 6.1595 6.8364 1.0613 1.0639 1.0372 1.0645 1.0682 1.0908 1.0935 1.0992 1.0978 1.1043 1.0982 1.0868 1.0915 1.0970 1.0803
irintensity: 0.8351 1.2315 0.4412 0.6661 3.9157 0.7216 0.6257 1.5435 2.3602 0.4018 0.7913 5.0504 0.6654 69.6786 18.4302 1.9998 1.4465 23.2056 0.4175 1.5114 0.2776 0.4616 4.0935 52.8887 1.4037 2.7257 1.5737 8.9260 0.4480 2.8586 1.1231 4.7326 2.6777 10.9405 11.0803 0.3260 1.0151 3.0653 5.3502 4.2475 1.5067 5.4986 3.2541 8.9991 12.0787 2.4329 1.6521 7.4281 26.0374 3.4381 6.6548 15.9659 5.6256 9.9795 29.3292 0.7675 5.9939 24.0660 1.5319 11.6181 4.8071 37.8210 13.0798 0.1232 19.1409 1.2347 64.9964 37.5644 60.1527 28.7996 23.5054 64.6379 28.7840 80.9856 26.3941 68.1193 21.1208 8.3108 22.1971 27.1491 43.7638
temp: 298.150 k
press: 1.00000 atm
elementType: 7 6 6 6 6 6 6 6 6 6 6 6 6 6 1 1 1 1 1 1 1 1 1 1 1 1 1 1 1
symmnumber: 1
zpe: 646781.1 jmol-1
zpe.correction: 0.246346 hartree
zpe.thermalcorrener: 0.258322 hartree
zpe.thermalcorrenthalpy: 0.259266 hartree
zpe.thermalcorrgfe: 0.208443 hartree
zpe.sumelectzpe: -558.147981 hartree
zpe.sumelectthermal: -558.136005 hartree
zpe.sumelectthermalent: -558.135061 hartree
zpe.sumelectthermalfe: -558.185884 hartree
dipole: 1.7921 1.3593 -0.0248
dipole: 2.2495
quadrupole: -75.9185 -72.0061 -87.7392
quadrupole: 1.9956 -0.0496 -0.3895
quadrupole: 2.6361 6.5485 -9.1845 1.9956 -0.0496 -0.3895
hfenergy: -558.3943269 hartree
pointgroup: C01 [X(C13H15N1)]
dipole: 0.6966066 0.5455195 -0.0195355 debye
polarizability: 213.735063|6.9333119|146.1156082|-0.126429|-2.5561628|80.4396286 unknown
InChI: InChI=1S/C13H15N/c1-9-6-7-13-11(8-9)10-4-2-3-5-12(10)14-13/h6-8,14H,2-5H2,1H3
charge 0 multiplicity 1
29 atoms
N  0.54235 1.79583 -0.085034
C  0.962796 -0.447861 0.014491
C  1.551577 0.816502 -0.039382
C  1.774977 -1.720809 0.073391
C  3.028054 1.106268 -0.05558
C  3.252201 -1.438545 -0.315811
C  3.800131 -0.16867 0.384442
C  -0.474575 -0.253124 0.007614
C  -0.71086 1.166554 -0.058983
C  -1.589293 -1.133361 0.046272
C  -2.014162 1.70586 -0.084454
C  -2.901318 -0.613768 0.020545
C  -3.095874 0.803719 -0.04436
C  -4.111209 -1.534792 0.0609
H  1.737257 -2.155396 1.094752
H  1.349719 -2.488794 -0.603014
H  3.355208 1.405041 -1.074192
H  3.280217 1.951906 0.616371
H  3.881746 -2.311395 -0.057269
H  3.321366 -1.301163 -1.413794
H  4.876689 -0.044092 0.160784
H  3.704812 -0.291069 1.481493
H  0.700257 2.800243 -0.125872
H  -1.433978 -2.218138 0.097267
H  -2.188504 2.786956 -0.134103
H  -4.120946 1.194756 -0.063456
H  -3.80895 -2.595583 0.109467
H  -4.748772 -1.327441 0.941763
H  -4.746617 -1.408233 -0.836649
