program: Gaussian 09
title: 000266126
version: EM64L-G09RevD.01
frameworkgroup: C1[X(C17H18O3)]
method: RPBEPBE
basis: SDD
operation: Freq
keyword: #pfreq=noraman
keyword: PBEPBE/SDD
title: #p freq=noraman PBEPBE/SDD
converged: YES YES NO NO
title: Mulliken charges:
elementType: O O O C C C C C C C C C C C C C C C C C H H H H H H H H H H H H H H H H H H
charge: -0.439823 -0.311794 -0.242543 -0.419360 -0.550442 -0.037997 0.509524 -0.716780 -0.392156 -0.405385 -0.411923 -0.325257 0.373522 0.215564 0.159007 -0.330990 -0.330271 -0.221853 -0.216631 -0.222647 0.210379 0.210630 0.234558 0.206335 0.214098 0.202723 0.242122 0.217370 0.237846 0.233927 0.248387 0.302302 0.322714 0.269463 0.266223 0.234154 0.231710 0.233293
chargesum: 0.00000
title: Mulliken charges with hydrogens summed into heavy atoms:
elementType: O O O C C C C C C C C C C C C C C C C C
charge: -0.117109 -0.311794 -0.242543 0.001648 -0.109548 0.176101 0.509524 -0.054566 -0.154310 -0.171457 -0.163536 -0.022955 0.373522 0.215564 0.159007 -0.061527 -0.064049 0.012301 0.015079 0.010647
polarizability: 3.28736785e+02 4.99408079e+00 1.88061620e+02 1.52302922e+01 -2.43690635e-01 1.02361044e+02
1716.lowfreq: -9.3429 -5.8050 -5.0868 -0.0013 -0.0008 -0.0006 8.7526 18.0304 23.2200
frequency: 7.9706 17.7798 23.0490 30.1274 51.0627 77.3135 79.2767 112.4370 148.8533 159.2434 191.2371 219.5525 230.6167 270.4024 309.0227 314.9961 325.2328 366.1612 400.3094 403.1919 410.7397 434.2679 440.7885 459.2202 465.6766 526.6440 562.1234 613.8972 627.9203 669.5606 671.2234 700.1169 722.6874 743.7169 768.9182 793.8152 801.0684 819.3875 827.0767 839.2354 858.7158 864.7413 909.9721 946.5846 955.0910 959.4348 980.6520 990.2889 996.7914 1007.4511 1009.4018 1014.7026 1021.7976 1029.3874 1040.8533 1077.7467 1085.5153 1100.5737 1126.6775 1151.3813 1154.4878 1174.1476 1181.1702 1196.3677 1220.0076 1237.1065 1245.5064 1260.7358 1294.8228 1306.8760 1314.6764 1320.3550 1346.7012 1369.8707 1379.1407 1383.2662 1390.1680 1411.2498 1438.0146 1452.6718 1467.7282 1470.9282 1475.8203 1483.3434 1490.2897 1582.4098 1585.2991 1609.9891 1616.3851 1624.0617 2963.8928 2971.9759 2987.3618 3016.3700 3031.9906 3054.2438 3068.7623 3091.0927 3124.2062 3127.1588 3131.0557 3143.5967 3156.2772 3163.7800 3168.2631 3182.1776 3211.0962 3537.7368
redmass: 3.8525 5.2063 3.9061 4.4184 5.3060 4.9102 6.2394 2.9218 4.7151 4.2534 4.5203 1.7988 1.7779 4.5527 1.9138 1.7615 3.1827 3.1995 3.5081 2.8435 2.9696 4.4984 3.5718 5.6606 2.4363 3.1412 4.1694 6.4388 6.9500 6.4965 5.1764 1.6406 3.9668 5.5444 1.5185 2.0854 4.2371 2.5274 3.0610 1.4179 1.8817 1.2456 1.8038 1.4814 1.4178 1.3675 1.3434 6.2789 1.3851 3.3876 1.3305 3.6841 2.4139 1.8673 2.4507 1.7401 1.6090 1.7440 1.3354 2.0806 1.7547 1.0563 1.1344 1.3761 2.7274 3.9281 1.4171 1.3194 1.3256 1.2707 1.3171 1.3909 1.5465 1.1790 5.7413 1.2226 10.0731 3.1008 2.2470 1.0870 1.0539 1.0502 2.2495 1.1151 2.5275 7.0526 6.7765 6.0847 6.6354 10.4927 1.0598 1.0391 1.0607 1.0927 1.0910 1.1024 1.0973 1.0994 1.0903 1.0900 1.0855 1.0893 1.0941 1.0954 1.0984 1.0969 1.0940 1.0657
irintensity: 1.4832 0.3852 0.0507 1.2950 1.4589 0.8295 0.4233 1.2338 1.5605 0.3921 3.0464 6.9783 1.2015 0.2279 45.4049 121.6245 22.0467 0.5495 1.8601 0.0430 0.0768 19.0612 0.5210 8.5286 2.8203 14.9285 16.7010 1.0791 0.2976 13.7244 19.2730 83.4815 0.4289 5.5639 0.6893 23.8924 3.4637 22.6362 18.8181 4.0913 53.2861 0.0339 4.2065 4.3492 3.1189 3.3118 1.2854 5.1141 0.0533 1.5255 0.4179 187.4830 20.5610 68.3133 148.5864 0.7033 7.6318 29.9308 44.9122 307.7245 18.0611 0.0808 85.0149 111.3040 10.6695 377.7227 0.9221 6.8495 5.0088 2.7585 0.6008 6.0322 10.7304 29.3678 9.2068 18.4798 3.5426 8.2788 13.5669 1.0928 7.2839 11.8404 6.5435 16.1884 137.4393 15.0251 15.8085 11.6012 3.4554 143.9588 7.0412 28.9911 34.1494 7.6298 12.3198 14.4786 73.7494 34.8386 16.5327 21.8302 0.0904 10.9727 16.9491 5.9264 25.0609 8.2325 3.6970 5.3751
temp: 298.150 k
press: 1.00000 atm
elementType: 8 8 8 6 6 6 6 6 6 6 6 6 6 6 6 6 6 6 6 6 1 1 1 1 1 1 1 1 1 1 1 1 1 1 1 1 1 1
symmnumber: 1
zpe: 803760.8 jmol-1
zpe.correction: 0.306136 hartree
zpe.thermalcorrener: 0.325266 hartree
zpe.thermalcorrenthalpy: 0.326210 hartree
zpe.thermalcorrgfe: 0.254003 hartree
zpe.sumelectzpe: -882.833478 hartree
zpe.sumelectthermal: -882.814349 hartree
zpe.sumelectthermalent: -882.813404 hartree
zpe.sumelectthermalfe: -882.885611 hartree
dipole: 0.7622 1.7227 1.9449
dipole: 2.7076
quadrupole: -100.9873 -109.4754 -123.5637
quadrupole: 8.7886 -8.5577 2.2150
quadrupole: 10.3548 1.8667 -12.2216 8.7886 -8.5577 2.2150
hfenergy: -883.1396141 hartree
pointgroup: C01 [X(C17H18O3)]
dipole: 0.3012233 0.4523461 -0.9161966 debye
polarizability: 328.7496347|12.4053628|114.8212921|-10.1019869|30.193436|175.5885226 unknown
InChI: InChI=1S/C17H18O3/c1-13(18)7-8-14-9-11-16(12-10-14)20-17(19)15-5-3-2-4-6-15/h2-6,9-13,18H,7-8H2,1H3
charge 0 multiplicity 1
38 atoms
O  -6.789339 -0.735167 -0.826967
O  1.596418 -0.214028 -0.023088
O  2.335226 0.715152 2.012034
C  -4.866141 0.548281 0.099556
C  -4.127362 -0.712588 0.625034
C  -6.400404 0.371679 0.08158
C  -2.616399 -0.594954 0.508511
C  -7.144986 1.66729 -0.284834
C  -1.942461 -1.00737 -0.671623
C  -1.839003 -0.035856 1.552979
C  -0.547889 -0.861564 -0.802543
C  -0.438218 0.122134 1.449551
C  0.197388 -0.296524 0.256883
C  3.928825 0.213136 0.238116
C  2.575034 0.279985 0.860931
C  5.029525 0.670837 1.010066
C  4.144363 -0.283079 -1.074551
C  6.332542 0.632618 0.474695
C  5.45065 -0.318821 -1.605747
C  6.545932 0.137774 -0.834326
H  -4.515423 0.784944 -0.927051
H  -4.603647 1.421673 0.729304
H  -4.496784 -1.585487 0.05495
H  -4.415124 -0.87404 1.68239
H  -6.7417 0.007104 1.06808
H  -6.804541 2.056556 -1.264815
H  -8.231378 1.481028 -0.342972
H  -6.96559 2.455763 0.469104
H  -2.515253 -1.455894 -1.492244
H  -2.334551 0.281898 2.478737
H  -0.023071 -1.183283 -1.707306
H  0.142464 0.549627 2.266842
H  -6.582131 -0.455318 -1.756259
H  4.839538 1.04917 2.01989
H  3.290777 -0.632904 -1.660746
H  7.179407 0.985788 1.072686
H  5.616625 -0.701609 -2.618531
H  7.559182 0.107952 -1.250514
