program: Gaussian 09
title: 000266106
version: EM64L-G09RevD.01
frameworkgroup: C1[X(C11H9N3)]
method: RPBEPBE
basis: SDD
operation: Freq
keyword: #pfreq=noraman
keyword: PBEPBE/SDD
title: #p freq=noraman PBEPBE/SDD
converged: NO NO NO NO
title: Mulliken charges:
elementType: N N N C C C C C C C C C C C H H H H H H H H H
charge: -0.309189 -0.121062 -0.108366 0.246012 0.212332 0.386373 0.166487 -0.427135 -0.344294 -0.374344 -0.812434 -0.225119 -0.228075 -0.261661 0.258703 0.240398 0.250041 0.239540 0.235866 0.235867 0.267620 0.237221 0.235219
chargesum: 0.00000
title: Mulliken charges with hydrogens summed into heavy atoms:
elementType: N N N C C C C C C C C C C C
charge: -0.309189 -0.121062 -0.108366 0.246012 0.212332 0.386373 0.166487 -0.168432 -0.103896 -0.124303 -0.101161 0.042500 0.009145 -0.026442
polarizability: 2.01010527e+02 -2.66751323e+00 1.58442401e+02 1.13157037e-02 -7.52628286e-04 5.84735577e+01
1716.lowfreq: -11.0995 -0.0011 -0.0008 -0.0007 5.0062 5.9876 111.3698 112.9467 149.9966
frequency: 111.3643 112.9318 149.9962 193.6742 253.8555 287.3786 292.8878 343.8432 420.1470 428.6885 446.5845 508.9934 520.9916 561.6178 594.4824 639.6450 667.0530 699.9698 741.7530 750.2361 765.5462 773.4743 810.9230 865.7508 878.8158 923.4913 952.4332 954.8911 986.9668 990.5684 1006.6432 1038.4448 1046.3910 1069.7883 1123.8733 1173.3498 1183.4834 1193.9482 1197.6022 1281.1168 1296.7217 1326.5877 1364.9731 1392.8168 1399.4643 1410.5490 1436.1502 1461.5220 1468.3506 1476.8771 1514.9353 1559.1046 1617.7260 1627.3711 2975.3101 3049.8263 3097.8036 3138.2264 3148.9884 3161.4769 3174.1893 3178.7761 3259.9350
redmass: 4.1177 4.1745 4.2367 1.0589 4.7579 4.6575 3.1785 4.3633 3.0740 7.4345 6.3794 5.9080 3.4621 3.9876 3.1436 4.8371 6.0236 3.2701 1.9096 6.3157 1.4440 2.6407 4.7154 1.4352 1.4062 5.8627 1.3783 6.3504 3.4743 1.3290 2.5785 2.7099 1.5292 2.0739 2.3392 1.5564 1.1861 2.3098 2.4213 2.4955 1.8683 3.0934 3.2900 4.4860 1.6020 2.9840 2.8065 2.3756 1.0455 1.4231 3.7267 5.5845 6.6149 7.3671 1.0383 1.0974 1.0978 1.0855 1.0893 1.0948 1.1006 1.0930 1.0989
irintensity: 0.8172 2.9879 0.0538 0.2570 1.2757 8.0919 2.0606 0.0009 8.9019 2.7496 0.0537 1.6345 3.1193 3.7300 0.0798 2.1170 2.3236 2.5586 10.9036 0.4844 78.2529 30.8296 0.0021 6.4728 18.0252 9.6072 2.9648 2.6166 1.8421 0.0064 2.1408 6.0567 5.5933 2.0308 0.3068 15.2892 10.1012 8.0884 5.1112 23.8387 3.0642 3.1762 2.5215 0.6534 20.5556 34.0725 5.0069 39.4128 16.1157 1.2753 8.9407 9.5669 7.5489 18.6657 27.4213 17.1696 18.1408 0.1234 5.3367 17.7653 17.1733 2.8237 0.4919
temp: 298.150 k
press: 1.00000 atm
elementType: 7 7 7 6 6 6 6 6 6 6 6 6 6 6 1 1 1 1 1 1 1 1 1
symmnumber: 1
zpe: 463441.0 jmol-1
zpe.correction: 0.176515 hartree
zpe.thermalcorrener: 0.186788 hartree
zpe.thermalcorrenthalpy: 0.187732 hartree
zpe.thermalcorrgfe: 0.140866 hartree
zpe.sumelectzpe: -587.852578 hartree
zpe.sumelectthermal: -587.842306 hartree
zpe.sumelectthermalent: -587.841362 hartree
zpe.sumelectthermalfe: -587.888227 hartree
dipole: 7.1537 -0.2691 0.0015
dipole: 7.1587
quadrupole: -99.0457 -65.5656 -85.0431
quadrupole: 0.4926 -0.0045 -0.0014
quadrupole: -15.8276 17.6525 -1.8249 0.4926 -0.0045 -0.0014
hfenergy: -588.0290933 hartree
pointgroup: C01 [X(C11H9N3)]
dipole: -2.8155417 0.0719771 -0.0006065 debye
dipolederiv: -0.7565585 -0.1790774 -0.0001981 -0.2852886 -0.1534983 0.0000721 -0.0000605 0.0000723 0.0435778 -0.4376759 0.2194985 -0.0000959 0.012292 -0.1716576 -0.0001652 -0.0001144 0.000052 -0.2354657 -0.2128168 -0.0878521 0.0003162 0.1221238 -0.0982291 -0.000019 0.0001846 -0.0000007 -0.2472465 0.5498615 0.1169051 0.0000746 -0.0177418 0.0283147 -0.0000044 -0.0000418 0.000008 0.0920365 -0.0714749 0.1084966 -0.0000153 0.2209263 -0.1130771 0.0000328 0.0000609 0.0000128 0.0032678 0.1387322 -0.1520223 -0.0000176 -0.0260271 0.3358171 -0.0000291 0.0001263 -0.0000349 -0.0510671 0.5566526 -0.0569436 -0.0000839 0.2264116 0.084938 0.0000664 0.0001135 0.0000434 0.0910133 -0.1002823 0.1341124 0.0000279 -0.0480001 0.0131832 -0.0000131 -0.0000692 0.0000156 -0.1239532 -0.098881 -0.0544158 -0.0000053 -0.0453463 0.0042446 -0.0000165 -0.0000027 0.0000196 -0.1570544 0.0673449 -0.0558916 0.000009 -0.04901 0.0620782 -0.0000078 0.0000305 -0.0000066 -0.1457632 -0.0304815 0.1118035 -0.0000129 0.038579 -0.085167 0.0000116 -0.0000094 0.0000239 0.0714745 0.2009665 -0.0266664 0.000042 -0.0625699 0.0181208 0.000072 0.0000215 -0.0003555 -0.0703887 -0.1010976 0.0209619 0.0000249 0.0589551 0.1082736 0.0000023 -0.0000195 -0.0000096 -0.1489352 0.112777 -0.0040701 0.000018 -0.1406407 -0.1142256 0.0000092 0.0000276 0.0000099 -0.1557069 0.078406 -0.0559124 -0.0000022 -0.0322159 -0.0103364 0.0000082 -0.0000744 0.0000215 0.1597589 0.0347879 0.1058477 -0.0000051 0.0542289 -0.0145028 0.0000067 0. 0.0000062 0.1636712 0.0596828 0.0655397 -0.0000084 0.1022091 -0.0344406 0.0000077 -0.0000305 -0.0000062 0.1421414 -0.0002493 -0.1726596 0.0000005 -0.0496028 -0.049324 0.0000022 -0.0000021 -0.000002 0.1117552 -0.003825 0.0664679 0.1090943 0.0281544 0.0602511 0.0208254 0.1149982 -0.0329514 -0.0346592 -0.0037975 0.0664484 -0.1090918 0.0281444 0.060256 -0.0208321 -0.1149912 0.0329379 -0.0346767 0.1005802 -0.0814603 -0.0000462 -0.0408851 0.0362545 -0.0000246 -0.0001196 0.0001557 0.2024534 0.0377903 -0.0794579 -0.000006 -0.0926419 -0.0568162 -0.0000068 -0.0000063 -0.0000085 0.1602909 -0.1204419 -0.0096523 -0.0000185 -0.0020543 0.0895428 0.000002 -0.0000216 -0.0000034 0.163476 unknown
polarizability: 201.1770055|-0.0351831|158.2759222|0.0113406|0.0000369|58.4735577 unknown
InChI: InChI=1S/C11H9N3/c1-8-6-11-13-12-7-14(11)10-5-3-2-4-9(8)10/h2-7H,1H3
charge 0 multiplicity 1
23 atoms
N  1.036256 -0.666239 0.000149
N  3.100354 0.294522 0.000187
N  3.246828 -1.115143 0.000996
C  -0.375235 -0.702614 0.000121
C  -1.072279 0.555874 0.000074
C  -0.331034 1.82312 0.000047
C  1.759473 0.550075 0.000138
C  1.05549 1.794948 0.000066
C  -1.078674 -1.931544 0.000054
C  -2.498687 0.51216 -0.000024
C  -1.078284 3.141232 -0.000046
C  2.010323 -1.664079 -0.000083
C  -2.484204 -1.933475 -0.000017
C  -3.197351 -0.705769 -0.000055
H  1.65075 2.711228 0.00004
H  -0.531805 -2.879671 0.000072
H  -3.05773 1.452728 -0.000083
H  -0.372815 3.987853 -0.000045
H  -1.72771 3.240352 0.890626
H  -1.727622 3.240283 -0.890792
H  1.810865 -2.730767 -0.000136
H  -3.025829 -2.885059 -0.000056
H  -4.292181 -0.710114 -0.000132
