program: Gaussian 09
title: 000266103
version: EM64L-G09RevD.01
frameworkgroup: C1[X(C11H9N3)]
method: RPBEPBE
basis: SDD
operation: Freq
keyword: #pfreq=noraman
keyword: PBEPBE/SDD
title: #p freq=noraman PBEPBE/SDD
converged: NO YES NO YES
title: Mulliken charges:
elementType: N N N C C C C C C C C C C C H H H H H H H H H
charge: -0.261639 -0.108610 -0.141963 0.223733 0.027790 0.379233 0.247070 -0.214564 -0.353300 -0.368666 -0.401335 -0.776738 -0.230440 -0.234127 0.253411 0.237017 0.276531 0.233715 0.234849 0.234878 0.275294 0.235138 0.232723
chargesum: 0.00000
title: Mulliken charges with hydrogens summed into heavy atoms:
elementType: N N N C C C C C C C C C C C
charge: -0.261639 -0.108610 -0.141963 0.223733 0.027790 0.379233 0.247070 0.038847 -0.116284 -0.092135 -0.167620 -0.031716 0.004697 -0.001404
polarizability: 2.24188512e+02 1.57974831e+00 1.41833299e+02 -1.51660920e-02 1.32140167e-03 5.84343706e+01
1716.lowfreq: -6.7082 -0.0004 0.0004 0.0007 0.9350 12.8120 87.2852 123.3679 157.1219
frequency: 87.2848 123.3657 157.1213 188.2194 213.8811 250.9198 290.3012 330.6053 422.1569 423.3409 484.1544 513.0353 522.5915 576.0782 617.7360 648.1465 660.6002 692.9836 700.9552 757.8641 786.6413 787.7225 805.7169 876.6421 890.9991 939.3722 949.3759 971.5682 979.9821 996.7201 1001.3261 1027.3244 1048.6391 1072.6679 1134.9937 1152.2815 1176.7046 1223.3420 1229.4108 1278.2824 1294.9401 1362.4012 1386.4065 1399.9468 1408.2336 1437.6031 1459.0716 1469.4682 1475.5345 1490.2808 1508.7911 1554.5719 1615.0925 1638.4447 2978.8763 3053.0264 3118.5432 3128.3328 3141.9489 3158.0740 3159.5024 3172.3078 3191.9441
redmass: 4.0246 3.3278 1.1346 3.6164 3.7849 4.7680 4.0909 4.8717 3.0372 5.5646 6.6688 3.7226 5.1752 3.3266 5.6662 7.0626 5.4832 5.8715 3.8788 1.3423 6.2764 3.5609 1.5178 5.1817 1.4882 1.3042 7.5740 1.3937 2.3004 4.2683 1.3417 2.2919 1.4589 3.3076 1.6650 1.8648 1.0748 2.4504 2.1118 3.1513 1.9037 2.8684 6.0017 1.2072 2.2947 2.5668 2.1182 1.0434 2.0797 3.1161 6.0961 6.0824 6.2477 7.0013 1.0391 1.0984 1.0960 1.0869 1.0898 1.0935 1.0899 1.1000 1.0989
irintensity: 2.5265 5.3715 0.5204 3.3013 0.7103 0.1144 0.7771 0.8930 7.6042 0.5740 2.7752 1.4548 0.2045 6.6934 1.4678 0.0596 2.5017 8.0351 16.5202 14.2320 0.0479 8.7966 99.5275 6.2657 0.6328 0.8002 0.7785 4.8848 0.0229 4.1900 0.2008 4.9585 3.1930 0.8867 11.2462 3.6743 0.6437 2.6092 7.8914 1.8005 0.3447 68.1948 4.2140 10.0014 0.6917 27.8178 18.0079 19.4146 7.4236 31.0108 6.8489 0.6699 7.6132 1.7455 30.4329 17.7659 3.3953 2.4098 11.9064 14.6422 6.4959 18.8799 6.9359
temp: 298.150 k
press: 1.00000 atm
elementType: 7 7 7 6 6 6 6 6 6 6 6 6 6 6 1 1 1 1 1 1 1 1 1
symmnumber: 1
zpe: 464117.6 jmol-1
zpe.correction: 0.176773 hartree
zpe.thermalcorrener: 0.187131 hartree
zpe.thermalcorrenthalpy: 0.188075 hartree
zpe.thermalcorrgfe: 0.140924 hartree
zpe.sumelectzpe: -587.859534 hartree
zpe.sumelectthermal: -587.849176 hartree
zpe.sumelectthermalent: -587.848232 hartree
zpe.sumelectthermalfe: -587.895383 hartree
dipole: -1.5868 5.6835 0.0024
dipole: 5.9009
quadrupole: -67.7774 -81.5239 -85.0155
quadrupole: 12.7125 0.0053 -0.0042
quadrupole: 10.3282 -3.4183 -6.9099 12.7125 0.0053 -0.0042
hfenergy: -588.0363069 hartree
pointgroup: C01 [X(C11H9N3)]
dipole: 0.6886875 2.217073 -0.0009521 debye
dipolederiv: -0.2320633 0.0873418 0.0000521 -0.4030973 -0.6250838 0.0001874 -0.000107 -0.0000179 0.0478017 -0.4420193 0.0265176 -0.0001601 -0.3436205 -0.2768749 0.0002833 0.0002472 -0.0000235 -0.237861 -0.1964614 -0.1102429 -0.000261 0.051872 -0.1796684 -0.0002715 -0.0004422 0.0000188 -0.2551936 0.159319 -0.0520571 -0.0000551 -0.0516526 -0.0231322 -0.0000226 0.0001061 0.0000389 0.0248461 0.0036887 -0.0005707 0.0001163 0.3770987 0.3756598 0.0000663 0.0000545 -0.0000945 0.0821489 0.007808 -0.1167244 -0.0000171 -0.0273875 -0.0682387 0.0000243 -0.0000716 -0.0000098 0.0407799 0.5447245 0.0183532 0.0003608 -0.1351893 0.2408304 -0.0002811 -0.0000846 0.0000599 0.0369146 0.1129968 0.0991336 -0.0000424 0.3950812 0.3015241 -0.0000877 0.0001066 -0.0000056 -0.1068672 -0.0021275 -0.0226362 0.0000078 -0.1445041 0.0838983 0.0000254 -0.0002549 -0.0000295 -0.1795913 -0.1533126 0.0962031 0.0000185 0.0196651 0.0561801 0.0000078 0.0000661 0.0000424 -0.1228785 -0.000744 0.0855467 -0.0000124 0.1269478 0.1037351 0.0000055 -0.0000354 -0.000004 -0.1661093 -0.0469259 0.0108358 -0.0000319 0.0809021 -0.0087825 0.0001286 0.0001622 0.0000728 0.1086692 -0.011538 -0.1204244 -0.0000437 -0.0968139 0.0507452 0.0000255 -0.0000272 0.0000373 -0.1517568 0.0648949 0.0332283 -0.0000431 0.0961445 -0.0328237 0.0000101 -0.0000258 0.0000192 -0.1500553 0.0175448 0.0862372 0.0000146 0.0276703 0.0208157 0.0000016 0.0001003 0.0000554 0.1800618 0.0630218 -0.0761773 0.0000196 -0.0092556 -0.0580361 -0.0000086 0.000021 0.0000161 0.1597282 0.0927867 -0.0627962 0.000005 -0.0173113 0.001089 -0.0000113 0.0000038 -0.0000084 0.1583417 0.0641962 -0.0222961 0.0000125 -0.0869257 -0.0942524 -0.0000093 0.0000232 -0.0000296 0.1567315 0.0464803 0.0097596 -0.0307126 0.1035268 0.0096936 -0.1031685 0.0386875 -0.1107599 -0.0385132 0.0465957 0.0097579 0.0307147 0.1033161 0.0099553 0.1031127 -0.0386573 0.1106513 -0.0386412 0.0062622 -0.0429867 -0.0000174 -0.1406741 0.048621 0.000017 0.000047 0.0000154 0.1316271 -0.0142361 0.0980231 0.0000335 0.1120947 -0.0231213 -0.0000353 0.000032 -0.0000421 0.1588915 -0.1308914 -0.0340258 0.0000414 -0.0378873 0.0872664 0.0000006 0.0000484 -0.0000028 0.1609253 unknown
polarizability: 224.0283775|-3.9570007|141.9934328|-0.015198|-0.0008824|58.4343706 unknown
InChI: InChI=1S/C11H9N3/c1-8-12-13-11-10-5-3-2-4-9(10)6-7-14(8)11/h2-7H,1H3
charge 0 multiplicity 1
23 atoms
N  -1.452775 0.458012 0.000435
N  -1.292301 -1.806697 0.000154
N  -2.665233 -1.435816 0.001412
C  0.854813 -0.431011 0.000099
C  -0.573026 -0.65406 0.000284
C  1.324595 0.931109 0.000159
C  -2.745498 -0.082623 0.00011
C  -0.994254 1.7817 0.000474
C  0.359577 2.020143 0.000355
C  1.783047 -1.506968 -0.000166
C  2.729351 1.171439 -0.000058
C  -4.003962 0.720915 -0.000513
C  3.161983 -1.241881 -0.000338
C  3.636941 0.100312 -0.000283
H  -1.75156 2.567899 0.000493
H  0.715198 3.054589 0.00028
H  1.39841 -2.531512 -0.000226
H  3.094299 2.205241 -0.00004
H  -4.084828 1.367082 0.893981
H  -4.084534 1.366353 -0.895567
H  -4.856615 0.02481 -0.000362
H  3.87698 -2.071361 -0.000538
H  4.714593 0.295524 -0.000441
