program: Gaussian 09
title: 000266102
version: EM64L-G09RevD.01
frameworkgroup: C1[X(C10H7N3)]
method: RPBEPBE
basis: SDD
operation: Freq
keyword: #pfreq=noraman
keyword: PBEPBE/SDD
title: #p freq=noraman PBEPBE/SDD
converged: YES YES YES YES
title: Mulliken charges:
elementType: N N N C C C C C C C C C C H H H H H H H
charge: -0.225476 -0.119041 -0.107094 0.243778 0.387384 0.052532 -0.340912 -0.209397 -0.365556 -0.394694 -0.209035 -0.227022 -0.231953 0.238561 0.253492 0.277376 0.235263 0.271550 0.236308 0.233936
chargesum: 0.00000
title: Mulliken charges with hydrogens summed into heavy atoms:
elementType: N N N C C C C C C C C C C
charge: -0.225476 -0.119041 -0.107094 0.243778 0.387384 0.052532 -0.102352 0.044095 -0.088180 -0.159431 0.062515 0.009285 0.001983
polarizability: 1.99089630e+02 -3.71169020e+00 1.33269641e+02 3.18006374e-03 4.14843246e-03 4.90574693e+01
1716.lowfreq: -8.5439 -0.0007 -0.0004 0.0003 5.4594 7.7811 114.3670 139.2475 237.6621
frequency: 114.3649 139.2468 237.6618 245.6756 286.8399 417.9128 424.3951 461.0865 509.0692 512.1225 572.3625 621.5951 638.9976 683.5577 696.2113 741.7355 760.9663 763.2853 789.1140 808.2455 874.3854 890.6549 911.2447 939.8402 948.7861 972.0567 1001.9917 1017.0056 1047.2881 1093.4476 1136.5223 1163.6055 1176.9484 1218.3536 1229.7262 1247.4607 1291.7214 1314.8527 1385.9671 1400.2317 1409.1033 1440.1285 1474.7460 1510.9595 1554.5286 1614.9218 1639.7575 3129.2047 3143.4182 3159.0323 3161.6216 3173.3253 3193.6476 3252.1204
redmass: 4.9738 4.9573 5.7633 4.3999 4.9349 2.9710 7.1402 6.1561 3.6617 5.5805 3.2278 6.4094 5.0002 6.3407 3.4563 1.4001 6.3468 1.3360 3.7395 1.5245 5.0019 1.4813 6.9230 1.3112 10.2945 1.3935 1.3433 3.6324 2.6389 2.2171 1.4801 1.5954 1.0714 2.6138 1.9343 3.4411 1.9619 2.8603 5.8122 2.4808 2.6593 2.6155 3.6897 6.3026 6.1004 6.2391 7.0494 1.0871 1.0897 1.0946 1.0886 1.1001 1.0994 1.0993
irintensity: 0.0273 11.1397 4.4682 0.1322 0.0091 5.4269 0.4500 2.3289 0.4604 0.6786 10.9036 0.5700 3.7023 2.0509 33.4108 11.4260 2.3070 7.8527 2.9134 122.0798 4.9992 0.6268 4.7726 0.3484 2.2724 4.6965 0.1717 3.1627 3.8934 7.3660 13.3344 18.7388 0.1374 4.3095 8.0234 6.4932 0.3657 15.6805 1.8818 18.5455 2.2428 28.4239 14.5305 9.0459 1.2796 4.1451 2.2801 2.6847 11.2972 15.1230 3.7692 17.7026 6.5441 0.2242
temp: 298.150 k
press: 1.00000 atm
elementType: 7 7 7 6 6 6 6 6 6 6 6 6 6 1 1 1 1 1 1 1
symmnumber: 1
zpe: 392034.5 jmol-1
zpe.correction: 0.149318 hartree
zpe.thermalcorrener: 0.157953 hartree
zpe.thermalcorrenthalpy: 0.158898 hartree
zpe.thermalcorrgfe: 0.115459 hartree
zpe.sumelectzpe: -548.623587 hartree
zpe.sumelectthermal: -548.614952 hartree
zpe.sumelectthermalent: -548.614008 hartree
zpe.sumelectthermalfe: -548.657447 hartree
dipole: 3.0542 5.3357 0.0016
dipole: 6.1480
quadrupole: -69.8327 -71.0116 -79.0123
quadrupole: -14.8850 -0.0042 -0.0020
quadrupole: 3.4528 2.2739 -5.7267 -14.8850 -0.0042 -0.0020
hfenergy: -548.7729054 hartree
pointgroup: C01 [X(C10H7N3)]
dipole: 1.2407816 2.0762997 0.000616 debye
dipolederiv: -0.1253188 -0.0070239 -0.0001073 -0.4141182 -0.5773609 -0.0001601 -0.0001076 0.0000759 0.0567574 -0.4621685 -0.0151501 0.0000687 -0.354729 -0.2433451 0.0000502 -0.0002103 -0.0000697 -0.2338706 -0.1191135 -0.0966362 0.0000137 -0.0658818 -0.1513832 0.000168 -0.0000255 0.0000555 -0.2461405 0.1015581 -0.0769661 -0.0000092 -0.0899459 -0.010702 0.0000115 0.0000961 -0.0000136 0.0386011 0.0244801 -0.1337077 0.0000169 -0.0170989 -0.0474005 -0.0000347 0.0000545 -0.0000222 0.0394412 0.1062488 0.0362383 0.0000871 0.4138603 0.3582348 -0.0000703 0.0000104 0.0000952 0.0786728 -0.0133193 -0.0023228 0.0000021 -0.124932 0.0796362 0.000002 0.0001508 -0.0000225 -0.1740934 0.1450695 0.0944636 0.000047 0.3422428 0.2879066 0.0000598 -0.0001589 0.0000267 -0.1029113 -0.1276649 0.1222695 -0.0000152 0.0337494 0.0375134 -0.0000036 -0.0000452 -0.0000117 -0.1219759 -0.0059622 0.1040909 -0.0000077 0.1368299 0.0817507 -0.0000005 -0.0000302 0.0000207 -0.1654455 0.2179463 0.0888222 -0.0001324 0.1086768 0.170658 0.000007 0.0003913 -0.0001057 -0.0682611 -0.0262206 -0.1275387 0.0000033 -0.0893286 0.0615323 0.0000078 0.0000036 -0.0000055 -0.1511129 0.0937282 0.0201572 0.0000137 0.0744106 -0.0306469 -0.0000022 0.0000043 -0.0000095 -0.1465984 0.0603886 -0.0876167 -0.0000119 -0.0163172 -0.0470029 0.0000029 -0.0000293 -0.0000076 0.1598556 0.0198621 0.075376 0.0000009 0.0157084 0.0081201 0.000001 0.0000342 -0.000033 0.1909738 0.0844714 -0.0674744 0.0000038 -0.0237038 0.01056 0.0000063 0.0000109 -0.0000017 0.1591499 0.0558886 -0.034593 -0.0000035 -0.0953669 -0.0824228 0.0000042 -0.000003 0.0000157 0.1572953 0.0921445 0.0302 0.0000461 0.0787494 0.0397583 -0.0000531 -0.0001356 0.0000055 0.2093626 0.0073422 0.0933833 -0.0000066 0.1062343 -0.0377363 0.0000041 -0.0000057 0.0000116 0.159364 -0.1293607 -0.0159713 -0.0000094 -0.0190394 0.0923304 -0.0000002 -0.0000049 -0.0000043 0.1609361 unknown
polarizability: 198.9272283|-4.9436385|133.432043|0.0032573|0.004088|49.0574693 unknown
InChI: InChI=1S/C10H7N3/c1-2-4-9-8(3-1)5-6-13-7-11-12-10(9)13/h1-7H
charge 0 multiplicity 1
20 atoms
N  -1.720322 0.659633 -0.000208
N  -1.748906 -1.614643 -0.000521
N  -3.086941 -1.133322 -0.000531
C  0.504874 -0.420844 -0.000007
C  1.087347 0.896703 -0.000048
C  -0.936645 -0.522533 -0.000063
C  0.217351 2.062737 -0.000179
C  -1.151641 1.941365 -0.000276
C  1.337995 -1.571768 -0.000011
C  2.507212 1.01794 0.000006
C  -3.043408 0.21689 0.000279
C  2.734334 -1.423825 0.00003
C  3.320629 -0.126332 0.000051
H  0.658385 3.063648 -0.000128
H  -1.840167 2.788361 -0.000239
H  0.868067 -2.560025 -0.000016
H  2.958196 2.017113 -0.000012
H  -3.908193 0.874097 0.000539
H  3.377056 -2.310428 0.000054
H  4.410879 -0.02277 0.000078
