program: Gaussian 09
title: 000266117
version: EM64L-G09RevD.01
frameworkgroup: C1[X(C13H12F3N3O2)]
method: RPBEPBE
basis: SDD
operation: Freq
keyword: #p
keyword: freq=noraman
keyword: PBEPBE/SDD
title: #p freq=noraman PBEPBE/SDD
converged: NO YES NO NO
title: Mulliken charges:
elementType: F F F O O N N N C C C C C C C C C C C C C H H H H H H H H H H H H
charge: -0.157525 -0.159171 -0.156253 -0.167898 -0.159692 -0.343817 0.035700 0.023897 0.273667 -0.568089 -0.476754 -0.186406 -0.255985 -0.244034 -0.431753 -0.453736 0.345563 0.099271 0.143156 -0.207301 -0.193215 0.263226 0.278290 0.251463 0.228569 0.280514 0.308366 0.328805 0.232113 0.217254 0.246852 0.234109 0.370816
chargesum: 0.00000
title: Mulliken charges with hydrogens summed into heavy atoms:
elementType: F F F O O N N N C C C C C C C C C C C C C
charge: -0.157525 -0.159171 -0.156253 -0.167898 -0.159692 0.026999 0.035700 0.023897 0.273667 -0.026573 0.003278 0.094108 0.052380 0.084771 0.017614 0.027225 0.345563 0.099271 0.143156 -0.207301 -0.193215
polarizability: 1.52647655e+02 2.84142437e+00 1.63424351e+02 -4.50465909e-02 -1.68989739e+00 1.35446253e+02
1716.lowfreq: -10.3602 -0.0005 -0.0002 0.0005 0.7003 14.8977 43.5288 46.1050 48.5453
frequency: 43.4852 46.0388 48.3300 57.6155 95.7637 99.6469 119.2883 137.5697 142.0757 160.1796 169.9553 216.2259 232.2210 263.7216 279.0096 296.3807 328.6267 348.0010 354.6131 373.0464 394.9427 428.7495 430.2330 438.4995 470.3753 486.8367 508.2932 511.7752 524.5689 543.7824 585.8755 614.2620 663.1059 678.0138 687.0698 763.3352 778.1212 808.1752 834.0632 853.7951 871.8466 883.2628 911.0571 941.9115 953.4321 960.0895 996.5278 1002.1323 1024.1852 1039.0997 1068.0777 1079.7637 1103.2782 1120.7199 1149.1324 1170.5331 1200.3882 1215.3023 1223.6161 1233.8534 1255.4099 1273.7997 1276.9265 1291.5934 1299.9191 1304.9827 1319.8885 1327.6840 1342.3466 1355.6757 1356.9048 1383.7887 1385.3561 1464.3367 1469.2331 1480.1586 1484.1165 1648.0802 1651.7957 2190.6765 2211.8557 2944.8682 2982.6687 2985.4334 2995.1949 2997.9830 3006.3119 3041.7046 3046.6626 3053.7082 3057.7263 3073.2397 3475.0834
redmass: 14.3249 13.6148 10.9216 11.5712 5.3079 8.9189 10.5343 7.9178 7.9642 4.6117 5.6710 5.4475 8.6112 2.7609 4.5296 4.5231 7.2666 3.5563 7.3144 6.5993 5.9456 7.3095 5.1068 5.0939 3.9411 7.1499 6.4168 3.5494 4.2344 4.7136 7.1691 5.9511 4.6851 6.3664 4.4085 2.5723 3.3462 1.6090 2.8261 2.0702 2.5682 2.9805 3.0015 2.7724 1.9515 2.8687 4.8224 3.8811 4.2399 4.3117 3.8929 1.8129 1.6451 2.8756 2.1993 1.9370 2.2123 1.7762 2.5844 1.7377 1.4628 1.5806 1.5267 1.4892 2.4542 1.7924 1.3587 1.3203 1.3378 1.4150 1.4451 1.5212 1.7092 1.0830 1.0868 1.0786 1.0902 8.8437 6.9512 12.5487 12.5758 1.0800 1.0673 1.0603 1.0665 1.0658 1.0721 1.0999 1.0824 1.0970 1.1024 1.1024 1.0762
irintensity: 0.5768 0.7744 1.0063 0.5569 1.3391 4.5551 8.0031 4.3948 2.2454 2.4313 1.8361 0.4312 0.9301 1.0236 1.3850 0.8427 14.6903 1.3760 5.4590 5.8116 5.0820 1.8174 0.2068 6.7889 1.6548 2.0315 3.9545 12.4321 2.3506 1.4471 11.5697 4.7301 1.0909 11.7516 8.9499 19.2662 11.1284 101.0904 14.8124 6.4705 12.7331 8.0868 10.6268 7.1348 4.0373 16.5164 115.6694 27.1995 40.3650 129.1586 32.0087 6.5819 5.7037 5.1310 10.2836 2.1417 101.8853 78.1149 133.7372 82.8563 6.3666 24.3441 5.4044 9.9708 60.7324 86.5400 45.2633 6.4202 19.9185 8.0450 4.7600 1.0598 3.5075 10.4088 6.8364 24.6407 7.8028 217.6675 356.3787 3.8321 1.9686 1.9759 20.7736 14.4604 2.5372 8.4750 13.6190 22.4603 0.0974 32.5114 8.9684 21.9388 62.3211
temp: 298.150 k
press: 1.00000 atm
elementType: 9 9 9 8 8 7 7 7 6 6 6 6 6 6 6 6 6 6 6 6 6 1 1 1 1 1 1 1 1 1 1 1 1
symmnumber: 1
zpe: 624444.6 jmol-1
zpe.correction: 0.237838 hartree
zpe.thermalcorrener: 0.256931 hartree
zpe.thermalcorrenthalpy: 0.257875 hartree
zpe.thermalcorrgfe: 0.190071 hartree
zpe.sumelectzpe: -1115.271372 hartree
zpe.sumelectthermal: -1115.252280 hartree
zpe.sumelectthermalent: -1115.251336 hartree
zpe.sumelectthermalfe: -1115.319139 hartree
dipole: 0.4674 -1.9628 4.1412
dipole: 4.6066
quadrupole: -137.5687 -149.3078 -124.0500
quadrupole: -2.8627 -3.1022 -1.9531
quadrupole: -0.5932 -12.3323 12.9255 -2.8627 -3.1022 -1.9531
hfenergy: -1115.5092104 hartree
pointgroup: C01 [X(C13H12F3N3O2)]
dipole: -0.1477981 -0.6385859 -1.6897118 debye
polarizability: 152.7331815|-3.0316496|162.8812814|-0.0587567|3.8992577|135.903796 unknown
InChI: InChI=1S/C13H12F3N3O2/c14-13(15,16)7-2-1-3-12(4-7)8(5-17)10(20)19-11(21)9(12)6-18/h7-9,19H,1-4H2
charge 0 multiplicity 1
33 atoms
F  4.561759 -0.656562 -0.360876
F  3.811064 1.348339 0.394299
F  3.538148 -0.517124 1.658453
O  -2.590929 -2.605741 -1.262205
O  -3.842829 1.556984 0.335269
N  -3.174372 -0.548402 -0.35552
N  -0.733095 -2.287063 2.419958
N  -0.923258 3.581754 0.669032
C  -0.390322 0.159431 -0.167109
C  1.010498 0.37382 0.474248
C  -0.360587 0.622365 -1.655119
C  2.148572 -0.295417 -0.340874
C  -0.829292 -1.350158 -0.077855
C  -1.459725 0.972135 0.659453
C  0.777902 -0.037961 -2.467434
C  2.156509 0.194027 -1.812659
C  3.493301 -0.032541 0.327855
C  -2.257845 -1.57787 -0.630153
C  -2.920081 0.723354 0.205525
C  -0.77081 -1.872203 1.302025
C  -1.181912 2.418834 0.666102
H  1.017148 -0.003033 1.514162
H  1.20719 1.461838 0.52065
H  -0.211537 1.719835 -1.661124
H  -1.332279 0.434436 -2.150727
H  2.030687 -1.397275 -0.322513
H  -0.172596 -1.977946 -0.705589
H  -1.406449 0.620996 1.714792
H  0.780923 0.386392 -3.48779
H  0.594115 -1.12413 -2.591619
H  2.943784 -0.331174 -2.381624
H  2.399703 1.273922 -1.833233
H  -4.143883 -0.710157 -0.659797
