program: Gaussian 09
title: 000266078
version: EM64L-G09RevD.01
frameworkgroup: C1[X(C15H11NO)]
method: RPBEPBE
basis: SDD
operation: Freq
keyword: #p
keyword: freq=noraman
keyword: PBEPBE/SDD
title: #p freq=noraman PBEPBE/SDD
converged: YES YES NO NO
title: Mulliken charges:
elementType: O N C C C C C C C C C C C C C C C H H H H H H H H H H H
charge: -0.427364 -0.017242 -0.072195 0.242699 0.243168 0.175151 0.175584 -0.479168 -0.413008 -0.412990 -0.389740 -0.389808 -0.234436 -0.234350 -0.227287 -0.227322 -0.123229 0.270266 0.270439 0.255784 0.255690 0.243742 0.243722 0.349976 0.231014 0.230987 0.229961 0.229959
chargesum: 0.00000
title: Mulliken charges with hydrogens summed into heavy atoms:
elementType: O N C C C C C C C C C C C C C C C
charge: -0.077388 -0.017242 -0.072195 0.242699 0.243168 0.175151 0.175584 0.061536 -0.157224 -0.157300 -0.145998 -0.146086 -0.003422 -0.003363 0.002674 0.002636 -0.123229
polarizability: 2.23851313e+02 -4.23306006e-02 1.59685161e+02 -1.73180667e-02 -2.15227796e+01 1.06903495e+02
1716.lowfreq: -7.2822 -6.6827 -4.5021 -0.0007 -0.0006 -0.0005 44.0166 54.2319 90.5299
frequency: 44.0149 54.2277 90.5285 127.5308 155.8034 189.9276 194.3146 226.6186 307.1564 312.1555 331.6797 344.5957 373.3109 407.5998 423.7271 478.6062 481.3830 508.3104 541.5452 566.5258 611.6542 620.8779 627.3893 702.3062 744.0991 754.6824 757.0456 774.8028 789.5194 816.0554 881.7560 886.4291 924.6673 953.5590 955.1023 987.6622 989.4808 990.1833 992.3546 996.3889 1017.9036 1025.3158 1034.9346 1105.7827 1106.1669 1156.5219 1171.7461 1175.5529 1188.4259 1229.6880 1235.3126 1287.6570 1294.4953 1299.1382 1311.9938 1375.1913 1407.0659 1438.6488 1443.1206 1446.7630 1465.7372 1485.8852 1596.5726 1597.8780 1617.7379 1620.2402 2209.5762 3010.3207 3068.3374 3127.6050 3128.3438 3135.2057 3136.5354 3147.3992 3148.6804 3165.1752 3165.9080 3560.8058
redmass: 8.1458 6.4995 4.8283 3.6997 6.4350 3.4182 4.7223 3.6552 2.3274 6.5947 1.5343 4.5397 2.9900 6.3807 3.2853 3.1680 6.8802 5.3501 5.8627 3.3501 6.0989 5.9519 4.1066 5.6652 2.2641 1.6848 5.2485 1.8007 2.1470 3.0421 1.3361 1.5174 4.3865 1.4610 1.4261 2.6866 3.2496 1.3497 1.5342 6.3273 3.0992 2.3735 1.8563 1.9219 1.7546 1.4580 1.1206 1.1042 2.2350 1.5637 1.9289 1.7340 1.5626 1.7261 1.6391 9.1440 3.3735 2.2232 1.3341 1.8864 2.6204 4.1810 7.2836 6.5617 7.1221 7.4656 12.4591 1.0583 1.1011 1.0854 1.0855 1.0896 1.0898 1.0948 1.0948 1.1003 1.1003 1.0661
irintensity: 3.6968 1.8218 2.8329 0.5255 0.7373 0.3297 0.0191 2.1322 24.0560 2.3654 92.2612 4.0356 2.8147 0.8239 9.6188 2.3693 2.5303 0.6812 0.7354 0.0075 0.3985 7.2142 25.9196 1.0305 83.9198 0.0031 7.2305 84.3878 0.0877 2.9550 0.9221 0.0060 75.2893 1.8972 0.0084 10.8561 30.6224 0.1291 7.0812 3.8126 3.4169 4.7639 1.5928 5.8377 2.5449 0.3960 0.6013 0.4550 3.2306 3.1562 3.8067 37.6383 10.0291 0.7523 40.3029 5.6009 0.5058 40.1884 4.4880 22.0441 3.7991 0.6406 0.7594 1.3700 1.5085 11.2739 7.6769 5.5931 2.5419 2.3678 0.9970 5.0113 2.0463 3.8706 39.9220 55.1650 6.6459 14.1457
temp: 298.150 k
press: 1.00000 atm
elementType: 8 7 6 6 6 6 6 6 6 6 6 6 6 6 6 6 6 1 1 1 1 1 1 1 1 1 1 1
symmnumber: 1
zpe: 562573.5 jmol-1
zpe.correction: 0.214273 hartree
zpe.thermalcorrener: 0.227957 hartree
zpe.thermalcorrenthalpy: 0.228901 hartree
zpe.thermalcorrgfe: 0.173841 hartree
zpe.sumelectzpe: -707.005827 hartree
zpe.sumelectthermal: -706.992143 hartree
zpe.sumelectthermalent: -706.991199 hartree
zpe.sumelectthermalfe: -707.046259 hartree
dipole: -0.0151 -1.9350 -3.2805
dipole: 3.8087
quadrupole: -82.7662 -89.8583 -112.7877
quadrupole: -0.0274 -0.0415 -7.9187
quadrupole: 12.3712 5.2791 -17.6503 -0.0274 -0.0415 -7.9187
hfenergy: -707.2200997 hartree
pointgroup: C01 [X(C15H11N1O1)]
dipole: 0.0414188 -0.8222596 1.2520268 debye
polarizability: 223.7808819|1.7877899|157.5236991|-2.1821306|23.9325609|109.1353881 unknown
InChI: InChI=1S/C15H11NO/c16-10-9-15(17)13-7-3-1-5-11(13)12-6-2-4-8-14(12)15/h1-8,17H,9H2
charge 0 multiplicity 1
28 atoms
O  0.006825 1.624869 2.177488
N  -0.087967 2.263726 -2.651986
C  -0.004853 1.155929 0.771669
C  1.203218 0.278401 0.415987
C  -1.183985 0.226361 0.452518
C  0.769789 -0.982211 -0.086239
C  -0.711403 -1.014402 -0.063723
C  -0.045963 2.506844 -0.001356
C  2.567274 0.580647 0.539796
C  -2.555669 0.468937 0.617111
C  1.713292 -1.950783 -0.484427
C  -1.623262 -2.023342 -0.434357
C  3.517656 -0.395736 0.144634
C  -3.473991 -0.548046 0.249466
C  3.091417 -1.646332 -0.365756
C  -3.009222 -1.779166 -0.274427
C  -0.068587 2.364009 -1.463947
H  0.837621 3.100638 0.297524
H  -0.941883 3.064477 0.328765
H  2.895982 1.546221 0.939767
H  -2.914064 1.419541 1.027339
H  1.395504 -2.92139 -0.880415
H  -1.275438 -2.979272 -0.840678
H  0.035185 0.828617 2.767369
H  4.588344 -0.181769 0.231863
H  -4.549914 -0.38073 0.368566
H  3.838439 -2.386927 -0.672138
H  -3.73214 -2.551604 -0.559212
