program: Gaussian 09
title: 000266157
version: EM64L-G09RevD.01
frameworkgroup: C1[X(C12H18FNO6S2)]
method: RPBEPBE
basis: SDD
operation: Freq
keyword: #p
keyword: freq=noraman
keyword: PBEPBE/SDD
title: #p freq=noraman PBEPBE/SDD
converged: YES YES NO NO
title: Mulliken charges:
elementType: S S F O O O O O O N C C C C C C C C C C C C H H H H H H H H H H H H H H H H H H
charge: 1.071051 1.070812 -0.213209 -0.392943 -0.393365 -0.578320 -0.486417 -0.579477 -0.485854 -0.173522 -0.431343 -0.430993 0.476141 -0.319731 -0.316705 -0.511632 -0.377407 0.340715 -0.182570 -0.413563 -0.759838 -0.760673 0.260154 0.247902 0.255469 0.250501 0.259967 0.253092 0.261960 0.253641 0.253193 0.228620 0.227584 0.256905 0.281287 0.294999 0.342803 0.343522 0.281365 0.295879
chargesum: 0.00000
title: Mulliken charges with hydrogens summed into heavy atoms:
elementType: S S F O O O O O O N C C C C C C C C C C C C
charge: 1.071051 1.070812 -0.213209 -0.392943 -0.393365 -0.578320 -0.486417 -0.579477 -0.485854 -0.173522 0.076713 0.074977 0.476141 0.193328 0.198896 -0.258439 -0.148787 0.340715 0.045014 -0.156657 0.159251 0.160093
polarizability: 3.27317008e+02 -7.54829470e+00 2.21407992e+02 -2.28116566e+00 1.46532768e+01 1.42889335e+02
1716.lowfreq: -10.5708 -6.8663 0.0011 0.0015 0.0019 1.7391 17.4347 29.0534 31.7960
frequency: 17.2591 28.9885 31.6904 35.4814 46.4243 61.6399 65.4866 81.7009 86.3748 93.8570 170.9604 176.4766 179.1998 180.2417 191.4623 207.4981 219.1002 224.4744 228.4150 235.6770 242.3695 250.6178 253.5261 257.1311 305.8658 319.2730 337.3196 342.2356 350.9563 387.0413 402.0811 404.7097 432.1072 450.6523 461.7272 467.3572 503.6760 564.2344 572.7997 592.0106 595.7037 596.6061 677.5814 707.2426 756.2498 770.3527 788.5111 818.0337 824.0967 826.9258 845.8185 880.1603 912.6018 913.5756 923.0209 923.5883 953.7680 971.9634 991.4206 995.4058 1002.9039 1011.9170 1019.1511 1048.5403 1054.8397 1058.0855 1079.8159 1111.8458 1146.2121 1175.8172 1184.6147 1224.6322 1236.2445 1282.0190 1286.9532 1297.9097 1317.9345 1322.2082 1324.8823 1327.0353 1372.3766 1379.1806 1381.4449 1401.6411 1411.8245 1414.6001 1432.6543 1435.9938 1437.8037 1443.4954 1455.3653 1481.6635 1490.6570 1508.4462 1579.4418 1630.2846 2985.4081 2986.3503 2993.0316 2997.8355 3003.8712 3005.6331 3058.1234 3059.0889 3080.3202 3083.3232 3140.1519 3152.1393 3153.0443 3163.5062 3176.7142 3184.3690 3184.7994 3189.6142
redmass: 6.8275 5.5611 7.1168 6.8575 5.8057 5.9927 10.6332 5.3091 5.2820 5.8044 3.4653 6.6713 4.7100 3.5849 3.0974 1.3150 2.0081 2.1576 3.2546 3.2863 2.7907 4.0351 3.9053 4.2038 7.8052 8.4426 10.3111 9.9465 4.1306 3.9985 3.1421 4.7051 4.2313 3.6841 6.7591 5.5624 8.4843 4.9543 5.1429 7.8695 5.6994 4.7564 1.9820 5.8950 1.3449 1.3098 1.3156 11.7793 10.6112 1.8666 1.4240 4.7402 6.9724 6.7485 3.8527 3.6210 1.3105 4.6079 1.3958 1.3496 2.7077 2.9283 3.9359 1.6751 1.7120 2.1572 1.6283 1.7324 1.8279 2.0536 1.1647 1.5504 1.4897 1.2167 1.1880 1.3417 1.1692 1.1526 1.1407 1.1695 1.5024 1.2470 4.0062 1.8331 1.0456 1.0529 1.0544 1.0551 1.0950 1.0834 2.7347 1.1551 1.4449 1.8787 6.6146 7.0762 1.0613 1.0606 1.0645 1.0650 1.0276 1.0270 1.0991 1.0991 1.1020 1.1023 1.0869 1.1068 1.1070 1.0938 1.0913 1.1074 1.1074 1.0968
irintensity: 0.0779 2.3057 5.2657 1.0017 1.2066 0.5263 0.3518 2.2789 2.0177 23.0349 1.6297 0.4330 6.1192 3.9476 1.3956 4.0988 5.1744 0.2978 0.0989 2.7585 2.3008 3.8240 0.2663 8.8470 15.5423 14.5331 41.0461 5.0661 18.1482 4.0031 6.6137 2.9923 11.7298 5.4043 26.1135 110.9502 2.9178 3.8758 4.3770 59.1782 14.2181 5.5915 21.9594 6.9584 42.1999 4.5261 17.5840 13.6457 83.9589 73.3962 4.6376 11.3368 69.8588 56.2401 120.0114 58.3617 0.5778 0.3261 11.7531 7.8152 118.5445 17.0007 9.2342 122.7260 35.7272 4.1362 9.9831 31.7498 80.6817 31.9049 1.7234 49.5837 27.2298 2.5303 1.2710 1.4762 2.9249 10.2831 11.8569 32.6281 39.9546 6.0294 8.0498 15.6916 3.4987 12.5290 34.2204 3.7847 13.4324 11.2411 7.4199 38.6820 76.2435 158.9820 96.1343 403.3212 2.7083 4.1708 29.9127 28.0047 2.2640 50.3890 6.2773 3.1054 14.3226 11.6963 15.0845 1.7022 47.3939 17.7558 4.2472 1.8601 0.2390 1.4437
temp: 298.150 k
press: 1.00000 atm
elementType: 16 16 9 8 8 8 8 8 8 7 6 6 6 6 6 6 6 6 6 6 6 6 1 1 1 1 1 1 1 1 1 1 1 1 1 1 1 1 1 1
symmnumber: 1
zpe: 774584.9 jmol-1
zpe.correction: 0.295024 hartree
zpe.thermalcorrener: 0.320316 hartree
zpe.thermalcorrenthalpy: 0.321260 hartree
zpe.thermalcorrgfe: 0.237609 hartree
zpe.sumelectzpe: -1868.063652 hartree
zpe.sumelectthermal: -1868.038360 hartree
zpe.sumelectthermalent: -1868.037416 hartree
zpe.sumelectthermalfe: -1868.121068 hartree
dipole: -2.2129 -1.3086 -0.6347
dipole: 2.6481
quadrupole: -149.1944 -169.1476 -148.4319
quadrupole: -13.0958 -2.7386 16.8146
quadrupole: 6.3969 -13.5563 7.1594 -13.0958 -2.7386 16.8146
hfenergy: -1868.3586763 hartree
pointgroup: C01 [X(C12H18F1N1O6S2)]
dipole: -0.6616226 -0.7753465 0.2156633 debye
polarizability: 222.7354273|10.4357297|326.6191016|-11.268045|8.0117198|142.2598048 unknown
InChI: InChI=1S/C12H18FNO6S2/c1-21(15,16)19-8-6-14(7-9-20-22(2,17)18)12-5-3-4-11(13)10-12/h3-5,10H,6-9H2,1-2H3
charge 0 multiplicity 1
40 atoms
S  -2.697775 -2.969004 -0.462017
S  2.083401 -3.274812 0.327592
F  2.471318 5.051399 -0.572889
O  -3.078116 -1.277895 0.300378
O  2.714947 -1.620316 -0.34164
O  -1.370191 -2.804999 -1.398721
O  -4.051655 -3.564766 -1.099345
O  0.776472 -2.969088 1.258031
O  3.325399 -4.091756 0.947293
N  -0.027873 0.924807 0.06376
C  -1.099067 0.15376 0.714089
C  0.964841 0.111554 -0.654688
C  0.054941 2.325631 0.146827
C  -2.258823 -0.181941 -0.257308
C  2.070135 -0.445278 0.280914
C  1.24035 3.013256 -0.256148
C  -1.039175 3.10822 0.635228
C  1.279761 4.410691 -0.165464
C  -0.942029 4.511012 0.720053
C  0.224376 5.201063 0.316241
C  -2.267319 -3.88066 1.147477
C  1.555609 -4.033414 -1.331481
H  -0.673612 -0.80491 1.06996
H  -1.473995 0.686411 1.603609
H  0.444632 -0.754883 -1.107065
H  1.404536 0.686211 -1.486786
H  -2.960847 0.657253 -0.408039
H  -1.844752 -0.476335 -1.242417
H  2.892292 0.269245 0.463251
H  1.6242 -0.72448 1.256259
H  2.130836 2.488956 -0.611335
H  -1.976216 2.627057 0.929571
H  -1.798481 5.08121 1.095761
H  0.314575 6.288452 0.367526
H  -2.293094 -4.951775 0.901073
H  -3.049692 -3.592788 1.862219
H  -1.261434 -3.527712 1.424619
H  0.598507 -3.550516 -1.584674
H  1.453701 -5.112336 -1.146656
H  2.369622 -3.799323 -2.030259
