program: Gaussian 09
title: 000266076
version: EM64L-G09RevD.01
frameworkgroup: C1[X(C15H13NO)]
method: RPBEPBE
basis: SDD
operation: Freq
keyword: #p
keyword: freq=noraman
keyword: PBEPBE/SDD
title: #p freq=noraman PBEPBE/SDD
converged: YES YES NO NO
title: Mulliken charges:
elementType: O N C C C C C C C C C C C C C C C H H H H H H H H H H H H H
charge: -0.465308 -0.006211 0.020070 0.345313 0.400344 -0.528585 -0.359160 -0.384434 -0.407022 -0.399240 -0.228125 -0.234349 -0.238759 -0.219339 -0.236425 -0.241164 -0.165833 0.266511 0.290753 0.269015 0.249420 0.240800 0.288653 0.364753 0.230089 0.227509 0.230357 0.227975 0.232366 0.230025
chargesum: 0.00000
title: Mulliken charges with hydrogens summed into heavy atoms:
elementType: O N C C C C C C C C C C C C C C C
charge: -0.100555 -0.006211 0.020070 0.345313 0.400344 0.028680 -0.090145 -0.135014 -0.166222 -0.110587 0.001965 -0.006839 -0.008403 0.008637 -0.004059 -0.011139 -0.165833
polarizability: 1.98525807e+02 -1.40895093e-01 1.46958721e+02 1.23872485e+01 6.83363546e+00 1.31792269e+02
1716.lowfreq: -14.3652 -12.5135 0.0006 0.0008 0.0009 4.0454 27.7748 34.8514 61.5371
frequency: 27.6045 34.7827 61.5025 73.3111 81.5294 151.4388 201.4533 217.1362 256.5775 284.4505 310.6249 329.1291 371.8071 381.9725 394.7610 401.8600 403.3241 435.2659 516.7395 545.0696 592.5533 615.1308 616.2707 651.4909 704.3702 706.6820 710.8036 764.8103 770.4655 839.5615 853.6616 861.0570 876.1678 924.0240 933.4547 956.7179 980.1319 984.4474 990.1048 990.2774 999.3326 1000.6626 1003.6686 1015.9949 1027.9673 1038.1214 1084.1149 1097.3395 1153.0892 1171.2031 1173.0002 1175.9541 1189.9556 1197.7918 1248.3776 1267.9492 1309.8473 1324.4382 1336.1049 1379.8511 1381.9494 1434.0599 1435.6817 1437.0382 1479.9548 1483.3007 1590.8034 1592.6368 1609.9981 1613.1214 2194.1025 3013.3113 3071.6751 3122.1437 3127.0757 3130.6241 3134.3657 3143.6523 3146.0523 3154.9184 3160.4257 3167.8983 3176.4926 3544.2486
redmass: 3.9558 3.9371 5.2162 6.7469 6.4065 5.5210 4.6155 4.4644 4.7740 5.1657 4.4631 2.6839 1.4060 2.9343 6.4924 2.8173 2.6409 4.1753 3.8421 3.8943 4.7571 6.4039 6.4234 5.8578 1.7491 1.8981 4.3845 1.8086 2.0407 2.7128 1.2530 1.2513 3.3303 1.5859 1.5356 2.9445 1.3972 1.4315 5.5249 5.6558 1.4149 1.4039 2.7750 4.2527 2.1822 2.1655 1.5801 1.6884 1.9493 1.4474 1.0644 1.1837 1.1554 1.1230 1.8544 1.3444 1.4568 1.3374 1.5593 7.8930 9.0675 1.5851 1.8468 1.5446 2.2609 2.1836 5.9682 6.3098 6.0100 5.9910 12.4266 1.0590 1.1010 1.0855 1.0847 1.0881 1.0878 1.0937 1.0923 1.0962 1.0984 1.1015 1.0962 1.0658
irintensity: 0.3460 0.6321 0.5128 2.5292 2.1114 3.2343 2.9071 2.1850 0.1217 1.7812 2.9828 45.4114 123.5131 2.6461 4.8165 2.7010 8.6430 4.0175 2.0320 4.7069 31.9994 0.4117 0.1263 23.9920 57.0396 44.5615 16.9543 54.1580 44.6023 0.9149 0.2747 0.4229 27.3115 8.2825 3.9481 3.2957 0.0588 0.3510 0.4981 0.9844 3.5099 3.6801 27.4786 28.8024 11.4542 1.2187 1.5406 2.1934 41.1605 6.2221 0.5287 1.8291 4.2753 1.0256 18.1987 13.3311 5.1322 4.6887 43.2610 1.5500 1.4392 5.0705 19.0983 33.9113 19.9300 8.4918 1.0362 0.1824 5.4589 1.0453 11.0265 3.5231 2.4452 3.0983 1.4485 3.3190 2.6966 29.2360 22.6854 25.9342 25.8411 16.3456 7.9732 11.5854
temp: 298.150 k
press: 1.00000 atm
elementType: 8 7 6 6 6 6 6 6 6 6 6 6 6 6 6 6 6 1 1 1 1 1 1 1 1 1 1 1 1 1
symmnumber: 1
zpe: 618127.3 jmol-1
zpe.correction: 0.235432 hartree
zpe.thermalcorrener: 0.250245 hartree
zpe.thermalcorrenthalpy: 0.251189 hartree
zpe.thermalcorrgfe: 0.192268 hartree
zpe.sumelectzpe: -708.162035 hartree
zpe.sumelectthermal: -708.147222 hartree
zpe.sumelectthermalent: -708.146278 hartree
zpe.sumelectthermalfe: -708.205199 hartree
dipole: 1.5882 -2.9022 -1.1985
dipole: 3.5188
quadrupole: -96.0109 -107.3146 -93.3089
quadrupole: 12.0491 0.2738 0.0860
quadrupole: 2.8672 -8.4364 5.5692 12.0491 0.2738 0.0860
hfenergy: -708.3974673 hartree
pointgroup: C01 [X(C15H13N1O1)]
dipole: 0.7361932 -1.0051995 -0.6034537 debye
polarizability: 195.8220092|-0.6201111|143.9159872|17.5549997|9.6636203|137.5388006 unknown
InChI: InChI=1S/C15H13NO/c16-12-11-15(17,13-7-3-1-4-8-13)14-9-5-2-6-10-14/h1-10,17H,11H2
charge 0 multiplicity 1
30 atoms
O  -0.172303 0.989066 1.863918
N  -2.424431 3.346984 0.134777
C  -0.037714 0.692626 0.421761
C  -1.092042 -0.351296 0.00954
C  1.398908 0.172084 0.22234
C  -0.147529 2.053671 -0.360532
C  -1.223119 -1.506413 0.82634
C  1.747819 -0.50441 -0.972994
C  -1.916669 -0.227464 -1.134597
C  2.395739 0.418932 1.196934
C  -2.158716 -2.511131 0.507129
C  3.077042 -0.927854 -1.192512
C  -2.857069 -1.234706 -1.455119
C  3.724222 -0.011474 0.978251
C  -2.981365 -2.378774 -0.637381
C  4.071154 -0.681848 -0.217045
C  -1.408065 2.769156 -0.105069
H  -0.016295 1.893978 -1.44614
H  0.690306 2.689015 -0.020888
H  -0.582695 -1.605312 1.709201
H  0.977642 -0.722833 -1.72235
H  -1.850733 0.653602 -1.781654
H  2.115667 0.92729 2.123419
H  -1.121383 1.210989 2.050972
H  -2.247497 -3.396203 1.146856
H  3.334266 -1.455287 -2.117894
H  -3.492826 -1.120038 -2.339921
H  4.487294 0.175907 1.742186
H  -3.71073 -3.157409 -0.886632
H  5.101722 -1.014345 -0.384594
