program: Gaussian 09
title: 000266070
version: EM64L-G09RevD.01
frameworkgroup: C1[X(C15H11NO)]
method: RPBEPBE
basis: SDD
operation: Freq
keyword: #p
keyword: freq=noraman
keyword: PBEPBE/SDD
title: #p freq=noraman PBEPBE/SDD
converged: YES YES NO NO
title: Mulliken charges:
elementType: O N C C C C C C C C C C C C C C C H H H H H H H H H H H
charge: -0.217751 -0.019892 -0.684554 0.516901 0.129337 0.305417 -0.367519 -0.420460 -0.348371 -0.341290 -0.361982 -0.369798 0.390727 -0.228648 -0.242381 -0.221077 -0.256065 0.266826 0.227560 0.270802 0.236850 0.278958 0.233999 0.258547 0.257260 0.236612 0.233363 0.236628
chargesum: 0.00000
title: Mulliken charges with hydrogens summed into heavy atoms:
elementType: O N C C C C C C C C C C C C C C C
charge: -0.217751 -0.019892 -0.190168 0.516901 0.129337 0.305417 -0.096717 -0.183610 -0.069414 -0.107291 -0.103435 -0.112538 0.390727 0.007963 -0.009018 0.015552 -0.256065
polarizability: 2.17822494e+02 1.07825435e+01 1.57877040e+02 1.28120957e+00 -1.53291424e+01 1.28103776e+02
1716.lowfreq: -12.5888 -5.4155 -1.6183 -0.0008 -0.0007 -0.0002 14.7627 26.5236 45.9627
frequency: 14.2347 26.3809 45.9359 70.0691 108.1700 138.8801 155.6687 198.3626 250.6372 300.4572 369.4524 391.5143 399.2174 402.9768 432.8207 447.8061 478.8663 545.5968 554.6562 577.9533 613.1536 642.0716 651.4719 692.1919 710.2887 727.7741 754.5448 793.4082 825.2941 851.9152 856.4818 867.1385 928.6282 943.3140 972.6281 988.3881 990.1758 990.7104 1011.3050 1012.3402 1015.4059 1037.7753 1086.7924 1115.4660 1152.9974 1175.4409 1188.4463 1189.3198 1204.8350 1207.7587 1268.7778 1278.8747 1315.0014 1318.6173 1368.2192 1388.5988 1412.9457 1435.6547 1461.1267 1480.3870 1497.5763 1560.5769 1568.7064 1595.2144 1609.5115 1618.2249 2177.6748 3013.4905 3075.0076 3126.6691 3131.1324 3141.0289 3141.5453 3153.0140 3162.0474 3162.1493 3166.8379 3171.8186
redmass: 5.5854 4.5148 4.0843 8.4540 8.9402 7.1080 5.3707 5.1101 6.0116 4.6067 3.6190 5.5751 2.8528 2.8992 3.6145 6.0788 3.6706 7.6327 4.2230 3.6225 6.4308 7.0405 5.5598 1.8590 2.7624 4.5639 2.6900 3.3729 2.4703 1.2906 1.3101 1.8512 2.1817 1.5321 1.4049 1.8916 1.3853 2.7826 1.7726 2.0340 3.1037 2.0047 1.5824 1.4650 1.2671 1.0599 1.3925 1.4532 2.2590 1.8858 1.8606 2.0470 1.3300 1.3521 4.5147 9.1216 3.1211 2.2524 1.1652 2.0358 2.3995 7.9999 6.4771 6.6866 6.0949 6.3991 12.6312 1.0589 1.1027 1.0894 1.0853 1.0893 1.0882 1.0923 1.0958 1.0959 1.0974 1.1010
irintensity: 1.6569 0.3089 0.5602 3.3926 2.9806 2.8853 0.6961 0.7798 4.7659 3.0616 0.4058 0.1516 0.0550 0.0570 3.1206 1.0638 3.5583 0.3529 0.7624 51.5161 0.9403 0.9187 16.4814 48.1476 24.5225 4.2331 31.4019 17.2140 31.9133 0.2861 0.9375 22.3251 16.6183 7.9087 5.9688 0.3948 0.7466 1.0351 10.3792 17.2285 8.0548 7.8214 8.2562 5.0122 42.3490 0.1720 6.3822 19.1007 2.6783 1.1302 126.7669 104.3346 3.8426 12.7557 5.5139 2.4076 9.4795 20.8776 19.9294 4.4900 29.9633 91.9215 40.1985 43.3811 26.3136 19.1264 44.4010 12.6918 9.7538 13.0886 0.2249 2.0909 5.4338 14.5661 10.0164 24.2876 0.4554 15.6759
temp: 298.150 k
press: 1.00000 atm
elementType: 8 7 6 6 6 6 6 6 6 6 6 6 6 6 6 6 6 1 1 1 1 1 1 1 1 1 1 1
symmnumber: 1
zpe: 561691.9 jmol-1
zpe.correction: 0.213937 hartree
zpe.thermalcorrener: 0.228136 hartree
zpe.thermalcorrenthalpy: 0.229080 hartree
zpe.thermalcorrgfe: 0.169854 hartree
zpe.sumelectzpe: -706.999754 hartree
zpe.sumelectthermal: -706.985555 hartree
zpe.sumelectthermalent: -706.984611 hartree
zpe.sumelectthermalfe: -707.043837 hartree
dipole: 4.5870 -1.1652 2.7132
dipole: 5.4552
quadrupole: -120.8562 -101.4093 -92.2398
quadrupole: -17.6090 -9.3726 -4.1779
quadrupole: -16.0211 3.4258 12.5953 -17.6090 -9.3726 -4.1779
hfenergy: -707.2136914 hartree
pointgroup: C01 [X(C15H11N1O1)]
dipole: 1.7246022 0.7718708 1.0179803 debye
polarizability: 209.9577166|25.5503909|135.9832083|-5.272829|-17.7861188|157.862386 unknown
InChI: InChI=1S/C15H11NO/c16-11-13-8-6-12(7-9-13)10-15(17)14-4-2-1-3-5-14/h1-9H,10H2
charge 0 multiplicity 1
28 atoms
O  1.384617 1.856955 -2.290726
N  -4.856302 -2.862914 0.289262
C  0.104293 2.065388 -0.243064
C  -0.965778 0.981032 -0.11686
C  1.322981 1.582913 -1.055352
C  2.395468 0.774502 -0.388335
C  -1.472233 0.340368 -1.27892
C  -1.485894 0.608267 1.148577
C  3.51111 0.36607 -1.171627
C  2.337524 0.398744 0.981188
C  -2.46984 -0.646952 -1.180944
C  -2.486924 -0.376444 1.260306
C  -2.98653 -1.015151 0.092808
C  4.546035 -0.396407 -0.598132
C  3.374099 -0.367877 1.554631
C  4.480315 -0.76531 0.768147
C  -4.008588 -2.023583 0.199301
H  -0.308106 2.925659 -0.800689
H  0.404793 2.421954 0.757267
H  -1.078489 0.621147 -2.262093
H  -1.115028 1.100886 2.055432
H  3.536763 0.661654 -2.225703
H  1.484174 0.690395 1.60107
H  -2.855237 -1.136156 -2.08098
H  -2.886306 -0.654061 2.240811
H  5.402191 -0.704813 -1.207678
H  3.320885 -0.657003 2.609693
H  5.285108 -1.359169 1.215609
