program: Gaussian 09
title: 000266143
version: EM64L-G09RevD.01
frameworkgroup: C1[X(C17H17Cl2N5O3)]
method: RPBEPBE
basis: SDD
operation: Freq
keyword: #p
keyword: freq=noraman
keyword: PBEPBE/SDD
title: #p freq=noraman PBEPBE/SDD
converged: YES YES NO NO
title: Mulliken charges:
elementType: Cl Cl O O O N N N N N C C C C C C C C C C C C C C C C C H H H H H H H H H H H H H H H H H
charge: -0.039227 -0.042217 -0.226061 -0.205575 -0.220221 -0.174429 0.022188 0.047109 -0.410032 0.000686 0.520914 -0.392167 -0.384828 -0.546740 -0.384149 0.231893 -0.584092 -0.587397 0.326204 -0.381133 -0.384024 0.232298 0.182056 -0.255113 -0.444464 -0.175001 -0.322439 0.254129 0.258464 0.255947 0.252950 0.290848 0.246388 0.268670 0.295948 0.272169 0.292488 0.302493 0.283480 0.304609 0.283373 0.242985 0.239859 0.251160
chargesum: 0.00000
title: Mulliken charges with hydrogens summed into heavy atoms:
elementType: Cl Cl O O O N N N N N C C C C C C C C C C C C C C C C C
charge: -0.039227 -0.042217 -0.226061 -0.205575 -0.220221 -0.174429 0.022188 0.047109 -0.105424 0.000686 0.520914 0.120426 0.124069 -0.255892 -0.137761 0.231893 -0.019474 -0.022739 0.326204 -0.078640 -0.100544 0.232298 0.182056 0.028259 -0.201479 0.064858 -0.071278
polarizability: 5.82790928e+02 2.72139565e+01 2.93711667e+02 2.73376110e+00 1.33094789e+01 1.21219104e+02
1716.lowfreq: -6.0610 -0.0013 0.0015 0.0016 2.9001 3.5275 11.3269 15.0870 18.3497
frequency: 11.2963 15.0115 18.3442 23.7298 28.4840 35.5043 41.6519 45.1128 64.9741 89.0455 104.0968 110.3369 127.9792 157.4636 163.1519 172.2255 179.0845 194.9384 209.8920 216.9840 241.7939 244.7330 271.6703 322.6633 336.6630 353.8377 371.0625 383.8144 406.0949 411.8633 428.9597 440.2276 446.6906 500.8316 516.0820 553.6978 568.7870 608.6035 635.3479 650.3817 663.8569 680.9133 691.7163 696.3555 700.9617 709.5996 720.1892 723.8616 737.0146 786.2937 790.6766 806.5155 835.1475 845.8606 857.8758 896.6299 900.2956 917.8735 952.7238 960.4412 968.8596 1000.1910 1000.6105 1004.2588 1004.5147 1018.8889 1035.0811 1036.2875 1042.3998 1047.9891 1052.2659 1108.7943 1120.2459 1129.6588 1164.7289 1185.4373 1191.1432 1198.6364 1219.9806 1240.5198 1249.0764 1258.4308 1259.6721 1278.0980 1289.6590 1293.4047 1308.9870 1312.3872 1335.8245 1352.2162 1357.5840 1360.8077 1381.5241 1395.6477 1406.7197 1452.3301 1456.4877 1461.5647 1463.1926 1488.1857 1496.3030 1508.1066 1518.5827 1520.9904 1545.1824 1553.7364 1582.7367 1615.6629 1630.1495 3019.8334 3024.5555 3062.6920 3064.0008 3075.6845 3081.0131 3087.5053 3106.0240 3139.7398 3146.6778 3147.3879 3154.2478 3156.6165 3173.0223 3175.6147 3191.8745 3381.8001
redmass: 11.5491 7.8428 13.5156 11.6318 8.0467 11.9646 6.9076 9.0653 6.2170 4.0804 5.5014 2.7775 3.0429 5.7415 5.2191 6.3612 6.9545 4.2436 5.6325 6.2053 3.6923 4.9423 5.2808 4.5790 7.9434 5.1886 3.5834 4.3472 5.1479 5.2324 7.5663 4.6245 4.7113 5.8581 4.4254 3.9454 3.8580 7.8576 4.9131 1.3178 6.9905 6.8854 5.2415 7.3021 7.3798 5.4380 1.8006 4.9703 6.9477 1.1428 1.2311 4.3266 1.8024 1.4624 6.6062 1.4537 5.9609 1.4246 1.4883 1.4572 2.5737 2.4393 1.7282 1.3324 1.5011 4.8456 4.3657 2.9689 3.3820 2.0023 2.5074 1.6112 1.5986 3.1375 1.6852 7.2541 1.6451 1.4127 2.1270 1.5108 2.4769 1.1662 1.1732 1.4869 1.5418 1.1804 2.2218 7.2329 1.3171 1.3553 1.4112 2.8475 3.6917 2.0907 1.9846 3.2653 2.0077 1.1210 1.1891 1.1239 1.8790 1.1970 6.3895 2.8032 5.5862 5.0010 5.9159 7.7525 6.7245 1.0602 1.0609 1.0571 1.0568 1.1042 1.1042 1.0899 1.0909 1.0890 1.1117 1.1117 1.0880 1.0917 1.0960 1.1002 1.0897 1.0755
irintensity: 0.1383 0.3143 0.0556 0.2364 0.8009 0.6214 4.3501 3.4572 6.3329 5.0218 9.9656 3.4781 0.4765 2.2916 1.9792 1.4322 3.5685 11.5947 11.7971 6.0267 13.0734 1.2409 7.3987 10.4494 6.8319 0.4977 1.0441 5.4674 3.6867 7.1509 0.3324 0.6096 0.6084 1.2253 8.7032 9.8980 7.8531 1.7737 7.4909 70.1483 7.7886 73.8527 4.6711 26.9345 13.7276 59.8346 58.2506 0.9348 30.6727 2.8753 7.6650 19.2330 22.7825 29.9115 16.2947 24.3095 43.7049 4.8221 35.4905 1.6125 70.0312 10.4659 3.1823 5.5144 1.7848 0.7992 0.4168 1.3075 2.0644 10.0842 2.1250 84.3620 21.5484 427.8228 46.8299 335.7975 86.7092 16.8345 9.2887 37.7288 419.9067 25.5731 43.6437 96.5520 7.3443 3.8468 102.9062 7.2099 3.3724 23.9191 80.6086 5.6919 29.9975 86.7835 17.0660 47.9933 90.4166 14.7154 12.2376 30.9258 702.3434 58.0328 1.8895 80.0471 2.1226 2.8365 23.6951 249.4283 406.3784 19.2411 21.5026 13.1595 19.1388 6.6269 7.4815 49.1838 34.6749 7.0270 5.5489 19.2644 4.2676 10.4009 12.4193 24.0247 9.4404 3.5655
temp: 298.150 k
press: 1.00000 atm
elementType: 17 17 8 8 8 7 7 7 7 7 6 6 6 6 6 6 6 6 6 6 6 6 6 6 6 6 6 1 1 1 1 1 1 1 1 1 1 1 1 1 1 1 1 1
symmnumber: 1
zpe: 853355.8 jmol-1
zpe.correction: 0.325026 hartree
zpe.thermalcorrener: 0.351064 hartree
zpe.thermalcorrenthalpy: 0.352008 hartree
zpe.thermalcorrgfe: 0.261691 hartree
zpe.sumelectzpe: -2075.481249 hartree
zpe.sumelectthermal: -2075.455211 hartree
zpe.sumelectthermalent: -2075.454267 hartree
zpe.sumelectthermalfe: -2075.544584 hartree
dipole: -0.3965 2.7101 -0.3422
dipole: 2.7603
quadrupole: -151.1948 -207.5714 -171.4369
quadrupole: -0.7330 -8.2384 -4.3133
quadrupole: 25.5396 -30.8371 5.2975 -0.7330 -8.2384 -4.3133
hfenergy: -2075.8062748 hartree
pointgroup: C01 [X(C17H17Cl2N5O3)]
dipole: -0.1583542 -1.0611322 0.1681519 debye
polarizability: 582.7517852|-27.4209314|294.4150832|4.2958624|7.1496362|120.5548303 unknown
InChI: InChI=1S/C17H17Cl2N5O3/c18-5-8-23(9-6-19)15-4-3-13(16(10-15)24(26)27)12-21-22-17(25)14-2-1-7-20-11-14/h1-4,7,10-12,22H,5-6,8-9H2
charge 0 multiplicity 1
44 atoms
Cl -7.482061 2.44036 -0.802206
Cl -5.724722 -4.555033 0.330023
O  -0.070099 3.300734 0.696083
O  -2.303225 3.688125 0.657225
O  3.726798 -2.264655 -0.195805
N  -4.700538 -0.559861 -0.118017
N  -1.290714 2.890081 0.562767
N  1.757273 -0.285508 -0.015311
N  3.104718 -0.012016 0.050909
N  7.223315 1.099254 -0.435456
C  -3.340678 -0.220617 -0.044725
C  -5.759771 0.440307 0.121266
C  -5.13523 -1.932421 -0.442912
C  -2.922668 1.112045 0.209502
C  -2.308835 -1.202889 -0.222451
C  -1.5540 1.447244 0.291546
C  -6.079372 1.232749 -1.16126
C  -5.165058 -2.820235 0.816289
C  -0.51229 0.481287 0.117711
C  -0.961401 -0.851371 -0.145053
C  0.931822 0.730587 0.183042
C  5.482508 -0.595689 -0.076514
C  4.047744 -1.050948 -0.089642
C  6.473962 -1.549844 0.270278
C  5.916385 0.707604 -0.441282
C  7.827762 -1.162175 0.27835
C  8.155405 0.171239 -0.066788
H  -6.672957 -0.079881 0.459294
H  -5.472932 1.132097 0.932459
H  -6.148205 -1.893154 -0.879996
H  -4.480629 -2.38335 -1.208991
H  -3.631848 1.929749 0.347358
H  -2.55788 -2.249399 -0.418443
H  -6.439482 0.582402 -1.97238
H  -5.233129 1.844093 -1.505594
H  -5.892213 -2.463463 1.560655
H  -4.173192 -2.939001 1.27554
H  -0.188285 -1.613549 -0.281827
H  1.272912 1.753074 0.396381
H  3.434803 0.943603 0.256426
H  6.158981 -2.568845 0.516659
H  5.210829 1.472475 -0.791552
H  8.617642 -1.870634 0.545131
H  9.194955 0.517231 -0.059292
