program: Gaussian 09
title: 000266066
version: EM64L-G09RevD.01
frameworkgroup: C1[X(C9H16O2)]
method: RPBEPBE
basis: SDD
operation: Freq
keyword: #pfreq=noraman
keyword: PBEPBE/SDD
title: #p freq=noraman PBEPBE/SDD
converged: YES YES NO NO
title: Mulliken charges:
elementType: O O C C C C C C C C C H H H H H H H H H H H H H H H H
charge: -0.200022 -0.223380 0.280117 -0.227203 -0.716961 -0.732904 -0.737471 0.157526 0.188534 -0.768109 -0.797641 0.233401 0.208794 0.208974 0.255180 0.236833 0.221004 0.207003 0.217318 0.208298 0.260401 0.248494 0.280320 0.241752 0.242851 0.257681 0.249210
chargesum: 0.00000
title: Mulliken charges with hydrogens summed into heavy atoms:
elementType: O O C C C C C C C C C
charge: -0.200022 -0.223380 0.280117 0.006198 -0.044013 -0.068064 -0.051454 0.157526 0.188534 0.002456 -0.047899
polarizability: 1.04074375e+02 2.43043824e+00 1.05265766e+02 -2.59388457e+00 1.00606629e-01 9.69855073e+01
1716.lowfreq: -24.0778 -15.4873 -10.9997 -0.0008 0.0003 0.0008 36.1574 46.6857 77.6567
frequency: 35.6313 46.0583 77.6134 110.4736 148.6927 164.7662 176.1188 193.8435 211.4905 263.3621 282.2060 290.6028 304.9713 310.7726 352.3182 389.9881 402.0457 437.3884 501.4273 564.8938 571.5960 600.2728 750.9447 793.7939 861.0316 895.6920 929.0601 932.1786 948.7931 955.6976 972.2863 999.9054 1028.3753 1036.9279 1043.5298 1157.2569 1170.4871 1203.0910 1209.5983 1229.0062 1287.7296 1322.8934 1361.8674 1375.9131 1379.0020 1383.0137 1406.8661 1437.1080 1441.5833 1443.0128 1449.2320 1457.9070 1465.8500 1471.5577 1478.8348 1487.0654 1498.4266 1603.3056 1624.4950 2969.8633 2975.6637 2975.7757 2980.0467 2987.7288 3016.4606 3057.6848 3062.5333 3066.4585 3071.5409 3075.4403 3081.1371 3089.5060 3093.5923 3120.5390 3134.9580
redmass: 3.4048 4.0380 3.1475 1.0815 1.0283 4.0447 4.6785 2.0028 1.3513 1.1274 1.3062 2.2507 1.7367 3.0570 4.7822 2.3537 2.5529 2.5685 3.3839 2.8808 2.6473 3.3601 3.3827 3.8377 2.6497 3.3331 1.7490 1.6947 1.2474 1.6514 1.8238 1.5383 1.7678 1.5472 1.6087 1.9322 2.4304 2.2876 2.7714 3.0535 1.5881 1.6651 1.2440 1.2208 1.2100 1.1902 1.2024 1.0788 1.0697 1.0568 1.0528 1.0505 1.0494 1.0499 1.0569 1.0572 1.0535 8.3828 6.5282 1.0355 1.0372 1.0356 1.0368 1.0419 1.0839 1.0960 1.0995 1.0993 1.0984 1.0999 1.0883 1.0998 1.0984 1.1003 1.1030
irintensity: 5.8011 2.1652 4.8408 1.2028 0.4803 0.3539 3.1156 4.4646 2.8288 0.5457 0.3185 0.4497 0.9542 0.3360 2.8502 0.1740 0.2873 1.0013 9.6602 8.2829 0.8450 8.6258 2.1794 3.0972 1.6447 2.4130 0.4278 1.0408 0.3990 10.3691 20.9595 1.0078 3.9424 1.3730 2.8440 55.8119 113.8454 79.6151 64.8045 20.0319 2.7739 48.3229 65.7307 22.4864 66.9117 40.1094 12.3965 16.3167 26.8791 16.7423 20.9536 3.1591 0.6454 3.3077 12.0540 12.4245 22.9528 198.9297 23.2457 28.6296 0.3608 27.0931 24.4304 2.3889 11.3613 9.1561 5.8392 16.9912 78.3661 22.4935 6.9148 17.3103 23.9511 14.1562 6.5149
temp: 298.150 k
press: 1.00000 atm
elementType: 8 8 6 6 6 6 6 6 6 6 6 1 1 1 1 1 1 1 1 1 1 1 1 1 1 1 1
symmnumber: 1
zpe: 602252.7 jmol-1
zpe.correction: 0.229386 hartree
zpe.thermalcorrener: 0.243422 hartree
zpe.thermalcorrenthalpy: 0.244366 hartree
zpe.thermalcorrgfe: 0.189073 hartree
zpe.sumelectzpe: -502.108752 hartree
zpe.sumelectthermal: -502.094716 hartree
zpe.sumelectthermalent: -502.093772 hartree
zpe.sumelectthermalfe: -502.149065 hartree
dipole: -0.0655 -1.8781 -0.6070
dipole: 1.9749
quadrupole: -66.4322 -72.4577 -71.9464
quadrupole: -3.5661 5.9435 8.5879
quadrupole: 3.8466 -2.1789 -1.6677 -3.5661 5.9435 8.5879
hfenergy: -502.3381375 hartree
pointgroup: C01 [X(C9H16O2)]
dipole: 0.2788463 -0.66355 -0.292634 debye
polarizability: 103.2681209|1.7083271|106.6892475|-1.1191852|0.9350994|96.3682803 unknown
InChI: InChI=1S/C9H16O2/c1-6(10)8(7(2)11)9(3,4)5/h8H,1-5H3
charge 0 multiplicity 1
27 atoms
O  -0.346155 2.528302 -1.285072
O  -1.39093 -1.382217 0.402371
C  1.371783 0.020491 -0.065893
C  0.008634 0.161914 -0.900188
C  2.376833 1.084044 -0.582429
C  1.960585 -1.392878 -0.333665
C  1.152167 0.20541 1.457422
C  -0.696997 1.515988 -0.619458
C  -0.917662 -1.049645 -0.720487
C  -1.799343 1.605043 0.422803
C  -1.245411 -1.838027 -1.981054
H  0.32068 0.210826 -1.961134
H  3.322113 1.00162 -0.01383
H  2.607043 0.933524 -1.6537
H  1.990513 2.11042 -0.466188
H  1.323882 -2.190204 0.09042
H  2.957334 -1.474411 0.137869
H  2.088512 -1.578654 -1.417343
H  0.854025 1.241632 1.701432
H  2.098312 -0.000674 1.991845
H  0.379054 -0.483746 1.838477
H  -1.966813 2.661339 0.685929
H  -1.582296 0.998039 1.314782
H  -2.737804 1.197962 -0.003577
H  -1.679356 -1.173126 -2.752326
H  -1.949377 -2.653347 -1.753167
H  -0.318928 -2.261924 -2.414337
