program: Gaussian 09
title: 000024749
version: EM64L-G09RevD.01
frameworkgroup: C1[X(C6H12O6)]
method: RPBEPBE
basis: SDD
operation: Freq
keyword: #pfreq=noraman
keyword: PBEPBE/SDD
title: #p freq=noraman PBEPBE/SDD
converged: YES YES NO NO
title: Mulliken charges:
elementType: O O O O O O C C C C C C H H H H H H H H H H H H
charge: -0.470808 -0.452175 -0.491033 -0.477808 -0.456561 -0.215288 -0.119108 -0.090553 -0.126490 -0.146945 -0.391143 -0.091908 0.240189 0.246456 0.248495 0.244114 0.216325 0.251320 0.369714 0.367960 0.243095 0.376943 0.369843 0.355366
chargesum: 0.00000
title: Mulliken charges with hydrogens summed into heavy atoms:
elementType: O O O O O O C C C C C C
charge: -0.101095 -0.084215 -0.114090 -0.107965 -0.101195 -0.215288 0.121081 0.155903 0.122005 0.097169 0.076502 0.151187
polarizability: 1.04965187e+02 2.33904587e+00 7.59966384e+01 4.71431893e+00 -6.26625000e-01 7.36134858e+01
1716.lowfreq: -8.5513 -6.8711 -0.0011 -0.0009 -0.0007 15.3899 42.0787 58.8742 67.9560
frequency: 42.0528 58.8239 67.9314 93.1152 117.7136 137.2816 194.1726 219.1949 271.7485 282.2793 297.2934 304.8796 320.9661 333.8712 423.5504 460.2169 500.9509 535.8028 572.3081 588.3477 626.3707 648.0801 690.8959 707.7349 799.4639 830.8492 911.3488 929.9440 941.0750 991.3628 1019.2117 1032.5582 1041.5985 1047.4383 1079.7458 1086.5967 1144.0995 1195.0433 1202.4926 1239.9302 1252.4287 1281.3314 1294.7577 1308.5696 1319.4904 1328.6878 1333.0311 1346.6822 1367.1076 1380.9177 1392.5615 1420.2633 1458.9510 1608.2356 2972.7228 2986.2037 2997.9929 3005.1712 3005.7185 3030.7122 3099.0699 3390.5826 3400.1806 3467.8008 3468.9096 3571.8899
redmass: 6.7284 5.3405 6.6364 4.4060 6.7180 3.3626 6.2952 4.8240 3.9986 4.6214 5.3903 5.4410 3.1928 1.2477 5.5056 1.2709 2.3779 3.0804 1.1044 1.4347 1.2444 2.0989 3.6283 3.2702 4.1183 3.2202 2.6165 3.0452 3.6504 2.7764 1.9672 3.3214 3.4772 2.4414 2.7140 2.7225 1.2637 1.2801 1.1935 1.3487 1.1738 1.1932 1.2415 1.2414 1.2619 1.2536 1.2116 1.2343 1.2905 1.3522 1.4514 1.6453 1.0793 7.9962 1.0820 1.0842 1.0816 1.0817 1.0763 1.0859 1.1027 1.0643 1.0641 1.0649 1.0641 1.0665
irintensity: 2.1123 4.0121 2.8546 7.6123 3.8142 1.1686 16.0776 8.8698 9.0743 19.7438 22.9646 24.6983 34.5357 85.1702 10.1583 142.0251 33.4435 19.3994 56.9312 43.8486 261.5324 86.1940 10.3219 54.4091 25.6927 20.8131 21.5351 60.6103 92.0490 54.1948 23.7055 40.7988 37.6798 66.7559 26.8586 18.8863 45.3638 29.4544 12.4103 39.7995 9.2255 7.0049 90.9475 60.0682 21.3441 16.9846 18.9785 15.0540 60.0935 30.5923 34.6744 5.4584 6.7722 121.1375 16.2258 15.5787 18.9977 24.1711 35.6263 44.0001 14.3514 54.2719 69.8115 61.3555 28.0936 12.4293
temp: 298.150 k
press: 1.00000 atm
elementType: 8 8 8 8 8 8 6 6 6 6 6 6 1 1 1 1 1 1 1 1 1 1 1 1
symmnumber: 1
zpe: 493329.8 jmol-1
zpe.correction: 0.187899 hartree
zpe.thermalcorrener: 0.201450 hartree
zpe.thermalcorrenthalpy: 0.202395 hartree
zpe.thermalcorrgfe: 0.147370 hartree
zpe.sumelectzpe: -686.144437 hartree
zpe.sumelectthermal: -686.130886 hartree
zpe.sumelectthermalent: -686.129941 hartree
zpe.sumelectthermalfe: -686.184966 hartree
dipole: 2.9376 0.7391 -0.6036
dipole: 3.0887
quadrupole: -74.5749 -74.4539 -71.0984
quadrupole: 3.6009 -7.2121 -3.1997
quadrupole: -1.1992 -1.0782 2.2774 3.6009 -7.2121 -3.1997
hfenergy: -686.3323361 hartree
pointgroup: C01 [X(C6H12O6)]
dipole: -1.1463717 0.1776519 0.3619049 debye
dipolederiv: -0.7138968 -0.0933946 0.0437168 -0.1541654 -0.414807 -0.1689604 -0.0102937 -0.143578 -0.6445751 -0.5403587 0.1106108 -0.0641768 0.0985767 -0.5047479 -0.1455624 -0.0540827 -0.2127768 -0.7098267 -0.5702411 0.0723459 -0.0850076 0.116974 -0.6382958 0.1337895 -0.1252488 0.0912559 -0.6159067 -0.7272644 -0.1706679 0.0436011 -0.2258135 -0.4886758 -0.0824527 0.0769644 -0.0378933 -0.4928308 -0.9718415 0.0024215 0.1656441 0.0063959 -0.490679 0.1843191 0.1437937 0.159463 -0.2443561 -0.7894946 0.226452 -0.1392416 0.1213094 -0.552947 0.0151313 -0.286512 0.1547003 -0.3483438 0.3809801 0.0665696 0.0213722 0.0857553 0.2410702 0.0577198 0.1739495 0.0784451 0.4677475 0.3859891 -0.2005438 0.0681983 -0.0678516 0.3194988 0.052687 0.070661 0.1101045 0.4676797 0.1452202 -0.0085196 0.169704 -0.1550388 0.2719506 -0.0816888 0.1122246 -0.05281 0.3803645 0.2374382 0.3711927 0.0535808 0.3868317 -0.1298282 0.0700725 -0.0719824 0.1565738 0.2454554 0.6120748 -0.128203 -0.0856237 -0.0320847 0.2517819 -0.0123747 -0.1264217 0.0141741 0.1958293 0.7170057 -0.2213759 0.263679 -0.3523743 0.7559697 -0.0502429 0.4327001 -0.1870287 0.1862589 0.0538978 0.0232618 -0.0426537 0.0260384 -0.0391573 0.0858252 -0.0448106 0.062844 -0.0479215 0.0029593 0.0650076 -0.0282108 0.0609417 -0.0881873 0.0774901 -0.019234 0.0467991 -0.068501 0.084391 0.0129312 0.0087296 -0.0103629 -0.0472832 -0.0806831 -0.0061832 -0.0496837 -0.0955475 0.0878352 -0.035617 -0.0246187 0.0154993 0.0278347 -0.0021608 -0.0306193 -0.0510553 -0.0838917 -0.006414 0.0403355 -0.0241336 0.0358068 0.0427681 0.0700003 -0.0364021 0.1102734 -0.1150678 0.0490109 0.0174722 -0.000953 0.0181276 -0.0087311 -0.0580285 -0.0146693 -0.1130897 0.0253373 0.4128923 0.0034918 -0.0885885 0.0182114 0.2442096 0.0791199 -0.0700579 0.0408194 0.3248609 0.2670487 -0.1434971 -0.0648459 -0.1216305 0.3155741 0.0517752 -0.0250844 0.0743044 0.3346759 0.032697 -0.0905901 -0.0584679 -0.1138102 -0.053006 -0.0374344 -0.0444007 -0.0523807 0.0845966 0.2255939 0.0286717 -0.0225577 0.0302123 0.3813482 -0.0606506 0.0344398 -0.0422658 0.3438307 0.2744294 0.0385321 -0.0326867 0.1546767 0.3478283 0.040558 -0.0392796 -0.0279577 0.2945464 0.3500475 0.0131127 -0.0764597 0.0577749 0.2565115 -0.1382485 -0.0394507 -0.129237 0.1155857 unknown
polarizability: 105.1374254|-3.9023042|75.2043379|2.6239082|1.3939129|74.233548 unknown
InChI: InChI=1S/C6H12O6/c7-1-3(9)5(11)6(12)4(10)2-8/h1,3-6,8-12H,2H2
charge 0 multiplicity 1
24 atoms
O  -0.477232 -0.960801 -1.429325
O  0.840266 1.032533 1.392838
O  -2.270894 0.926713 -1.04152
O  3.020137 1.241102 -0.181451
O  -4.236348 -0.218481 0.470433
O  3.524575 -1.356436 0.214212
C  -0.448744 -0.330489 -0.106734
C  0.647535 0.750595 -0.027526
C  -1.8386 0.265268 0.207661
C  2.00439 0.309581 -0.665227
C  -2.88002 -0.804972 0.58071
C  2.426319 -1.122831 -0.356031
H  -0.206563 -1.11901 0.629987
H  0.319722 1.666145 -0.563716
H  -1.742774 1.014537 1.019025
H  1.90106 0.37681 -1.767886
H  -2.692068 -1.209438 1.593961
H  -2.869669 -1.627546 -0.153006
H  -1.11626 -0.404092 -1.962436
H  1.695029 1.54296 1.449668
H  1.752397 -1.933389 -0.702616
H  -3.267409 0.940053 -1.016699
H  3.787108 0.683242 0.140683
H  -4.443058 0.300346 1.288396
