program: Gaussian 09
title: 000266067
version: EM64L-G09RevD.01
frameworkgroup: C1[X(C15H15NO2)]
method: RPBEPBE
basis: SDD
operation: Freq
keyword: #p
keyword: freq=noraman
keyword: PBEPBE/SDD
title: #p freq=noraman PBEPBE/SDD
converged: YES YES NO NO
title: Mulliken charges:
elementType: O O N C C C C C C C C C C C C C C C H H H H H H H H H H H H H H H
charge: -0.456719 -0.282579 -0.610156 -0.396461 -0.266684 0.424405 0.474570 0.234034 -0.439229 -0.363520 -0.418892 -0.392205 -0.226950 -0.236015 -0.238612 -0.230181 -0.238935 -0.241301 0.222535 0.250050 0.242420 0.288221 0.259559 0.269612 0.356611 0.228787 0.228979 0.226226 0.222402 0.230832 0.319347 0.333676 0.226172
chargesum: 0.00000
title: Mulliken charges with hydrogens summed into heavy atoms:
elementType: O O N C C C C C C C C C C C C C C C
charge: -0.100108 -0.282579 0.042867 -0.173926 -0.016634 0.424405 0.474570 0.234034 -0.196810 -0.075298 -0.159333 -0.122592 0.001837 -0.007036 -0.012386 -0.007779 -0.008103 -0.015129
polarizability: 2.33365219e+02 1.51362168e+01 1.46978601e+02 1.63185289e+01 -2.83249783e+01 1.25115464e+02
1716.lowfreq: -8.7273 -4.3144 -0.0006 -0.0005 -0.0004 7.2788 27.2052 39.5311 49.5346
frequency: 27.1849 39.4009 49.5146 54.5572 58.1794 101.9794 150.9617 161.2095 218.8672 235.5510 253.0661 310.5032 319.3324 369.9464 392.6534 404.2035 405.1499 466.8975 493.0549 508.2325 534.8934 557.0731 595.9826 603.7877 615.7583 617.7088 643.4415 704.7407 708.1039 714.9826 759.3865 764.7082 808.8949 857.0665 862.2972 864.0154 908.4722 926.7442 935.9504 983.0017 984.0810 988.1962 988.9434 990.6609 994.2033 999.0829 1005.5382 1026.8764 1028.7130 1059.2935 1081.1955 1084.8709 1163.2990 1171.6760 1172.9343 1187.4247 1189.6448 1193.8366 1207.5553 1236.1114 1246.8939 1308.1765 1322.2410 1331.7532 1363.9893 1373.8970 1384.6817 1391.3319 1441.1343 1442.5741 1479.1676 1484.0448 1586.6777 1592.0269 1594.0258 1608.6063 1614.8154 1636.8294 2983.3574 3012.0154 3120.2130 3120.7133 3128.7949 3129.4070 3140.3003 3141.7992 3150.2327 3155.5770 3164.8873 3166.4687 3516.2302 3531.4253 3672.3833
redmass: 4.3703 4.1273 4.7046 4.2371 5.1204 6.6286 6.1101 5.1599 4.6187 4.6926 4.3902 5.9760 3.6384 1.2584 3.4805 2.8617 2.8539 4.6912 2.5173 1.5190 2.1478 3.4195 3.2373 2.1028 6.3096 5.6423 3.5792 2.1123 1.8939 3.5771 1.9045 1.7965 3.7406 2.1929 1.3151 1.5019 2.3746 1.7210 1.5764 1.5276 1.6089 2.7369 5.2765 4.0790 3.2801 1.5530 1.5348 2.1976 2.1573 1.9044 1.6209 1.6399 1.4742 1.0755 1.0696 1.1603 1.3073 1.6677 1.3781 1.3681 1.7164 1.2176 1.3126 1.3263 2.8879 2.8745 5.4097 2.7971 2.1519 2.1695 2.2238 2.3712 3.5360 2.6313 4.2996 5.5020 6.0503 2.4662 1.0840 1.0856 1.0864 1.0846 1.0871 1.0884 1.0921 1.0936 1.0961 1.0966 1.1015 1.0991 1.0452 1.0652 1.1041
irintensity: 1.4862 0.2515 5.2581 8.1293 2.1766 3.5448 0.8796 9.2319 1.2433 0.2488 5.3972 10.3159 6.6876 126.1897 12.8185 0.5731 1.7325 1.3481 15.1609 83.1676 50.8362 48.3595 18.3850 112.5944 0.3248 7.7180 22.7047 73.3856 24.9961 16.1157 10.2893 76.8356 12.7087 0.9839 0.5302 0.8547 0.1992 9.6939 3.1406 0.0876 2.2276 8.4484 8.3495 3.8778 46.2512 9.2560 8.0193 16.5918 6.0539 2.1376 17.8450 0.2839 41.5824 4.0149 0.0472 7.0186 2.5284 2.9163 7.0324 16.1077 27.5447 7.3657 12.0412 15.7224 108.2280 20.9272 18.3146 13.8991 14.6931 6.8508 26.5112 16.7170 21.8560 21.3778 6.2915 6.6970 5.4202 238.2067 6.8904 25.8957 5.5273 0.5135 1.7914 7.5618 16.4505 25.1133 16.5182 27.8107 31.8396 13.5861 38.0464 8.9550 23.4160
temp: 298.150 k
press: 1.00000 atm
elementType: 8 8 7 6 6 6 6 6 6 6 6 6 6 6 6 6 6 6 1 1 1 1 1 1 1 1 1 1 1 1 1 1 1
symmnumber: 1
zpe: 694302.2 jmol-1
zpe.correction: 0.264446 hartree
zpe.thermalcorrener: 0.280558 hartree
zpe.thermalcorrenthalpy: 0.281502 hartree
zpe.thermalcorrgfe: 0.219219 hartree
zpe.sumelectzpe: -784.522871 hartree
zpe.sumelectthermal: -784.506759 hartree
zpe.sumelectthermalent: -784.505814 hartree
zpe.sumelectthermalfe: -784.568098 hartree
dipole: -0.9890 0.1926 3.5392
dipole: 3.6798
quadrupole: -92.8881 -107.8129 -98.8894
quadrupole: 7.4761 5.7416 -0.1152
quadrupole: 6.9754 -7.9494 0.9740 7.4761 5.7416 -0.1152
hfenergy: -784.7873168 hartree
pointgroup: C01 [X(C15H15N1O2)]
dipole: -0.423877 0.6319529 1.2316523 debye
polarizability: 232.1655828|23.1219053|122.9729441|10.699261|-26.396926|150.3207571 unknown
InChI: InChI=1S/C15H15NO2/c16-15(18)13(11-7-3-1-4-8-11)14(17)12-9-5-2-6-10-12/h1-10,13-14,17H,16H2
charge 0 multiplicity 1
33 atoms
O  0.058877 -2.084602 -0.00087
O  -0.11728 1.990224 -1.511071
N  0.268903 2.687703 0.664217
C  -0.419234 0.342085 0.295287
C  0.446885 -0.747083 -0.458907
C  -1.9129 0.027841 0.173047
C  1.934088 -0.581371 -0.181283
C  -0.080333 1.732178 -0.26809
C  -2.596839 -0.55298 1.273395
C  -2.621655 0.244852 -1.039739
C  2.731293 0.235445 -1.021262
C  2.528952 -1.213881 0.938958
C  -3.963655 -0.901033 1.172518
C  -3.986768 -0.103177 -1.137928
C  4.103082 0.424519 -0.739634
C  3.901109 -1.026615 1.217678
C  -4.662987 -0.676884 -0.035198
C  4.692463 -0.203658 0.382016
H  -0.132184 0.286875 1.362978
H  0.244581 -0.625236 -1.542699
H  -2.056878 -0.730063 2.21153
H  -2.100938 0.703728 -1.887463
H  2.276856 0.72405 -1.891217
H  1.916205 -1.876034 1.558638
H  -0.92181 -2.184026 -0.117566
H  -4.478137 -1.345966 2.031643
H  -4.524293 0.074287 -2.076222
H  4.711306 1.054605 -1.398494
H  4.355849 -1.52891 2.079416
H  -5.722139 -0.945524 -0.116405
H  0.335261 2.477015 1.657998
H  0.512636 3.622623 0.336159
H  5.757986 -0.062085 0.59647
