program: Gaussian 09
title: 000266062
version: EM64L-G09RevD.01
frameworkgroup: C1[X(C12H14O5)]
method: RPBEPBE
basis: SDD
operation: Freq
keyword: #pfreq=noraman
keyword: PBEPBE/SDD
title: #p freq=noraman PBEPBE/SDD
converged: YES YES NO NO
title: Mulliken charges:
elementType: O O O O O C C C C C C C C C C C C H H H H H H H H H H H H H H
charge: -0.277168 -0.261229 -0.239409 -0.415265 -0.245078 0.179210 -0.474869 0.133570 -0.492531 0.204920 -0.464997 0.331205 -0.347908 -0.360385 0.179082 -0.534635 -0.535924 0.276810 0.253320 0.260344 0.282745 0.305181 0.238095 0.243713 0.222090 0.225067 0.254703 0.248887 0.218598 0.218361 0.373498
chargesum: 0.00000
title: Mulliken charges with hydrogens summed into heavy atoms:
elementType: O O O O O C C C C C C C C C C C C
charge: -0.277168 -0.261229 -0.239409 -0.041767 -0.245078 0.179210 0.055261 0.133570 0.050558 0.204920 -0.159816 0.331205 -0.109814 -0.116672 0.179082 0.167226 0.149921
polarizability: 2.16335677e+02 5.27524154e+00 1.64076601e+02 7.23698085e-01 -1.35037193e+00 7.94382555e+01
1716.lowfreq: -0.0009 0.0000 0.0004 2.3620 4.1923 5.2518 17.0139 22.5771 51.2698
frequency: 16.7580 22.5679 51.2653 63.5302 74.2429 92.5406 102.3606 143.5033 161.6091 180.1653 193.1362 221.2723 231.8581 258.6032 270.2051 304.7434 350.9105 371.7599 404.2264 423.5682 457.1833 508.1452 522.2232 526.0667 572.9977 602.8681 610.5986 640.3501 648.2618 691.5039 728.7851 740.7422 795.8937 803.2368 850.9199 899.2632 912.9178 942.0533 979.4035 986.4686 1008.4239 1028.2224 1051.4458 1092.3294 1111.9228 1112.3391 1129.1521 1146.9443 1150.6515 1157.8231 1176.6689 1210.8701 1237.5022 1241.0107 1251.3511 1266.1986 1321.8106 1373.5817 1385.8157 1410.6805 1413.6704 1433.5164 1439.1716 1439.4767 1467.4810 1468.6298 1470.4879 1473.7742 1486.1747 1561.8572 1572.6818 1626.6648 1662.0837 2954.0921 2963.8771 3002.1358 3008.6250 3039.9017 3047.3748 3054.9924 3074.0081 3125.8913 3128.7056 3151.8260 3166.7751 3173.1173 3511.2000
redmass: 7.3741 9.7746 4.3493 5.2265 3.2600 3.4548 2.9547 2.6581 4.4740 3.8121 4.1102 5.7699 1.0965 1.1642 5.0320 4.7240 5.5263 5.0906 6.9590 3.2798 3.3738 2.0892 3.9386 2.9560 4.3002 3.5993 2.8767 2.5039 2.3657 5.8188 3.1027 5.5964 1.6179 1.7377 6.4265 3.8960 1.4379 1.4051 8.2092 7.5897 2.4461 2.8354 2.5739 2.5639 1.2597 1.2578 1.7216 1.3187 1.4293 1.4532 1.7449 1.7523 1.9643 2.6326 1.2685 1.6413 1.9287 2.1922 6.2187 3.5078 1.1478 1.2594 1.1660 1.0897 1.0638 1.2050 1.0508 1.0732 1.8102 7.6279 7.5685 6.9823 8.0454 1.0334 1.0326 1.0646 1.0634 1.1038 1.0949 1.1043 1.0955 1.0987 1.0998 1.0871 1.0913 1.0954 1.0638
irintensity: 0.5614 5.5148 0.9682 1.7156 6.0692 0.1012 1.1159 3.4548 3.9565 0.9888 3.4450 1.5355 0.1174 0.7140 5.7002 10.7976 2.4839 0.3263 0.8561 1.0092 48.9708 67.4869 0.6840 7.5736 38.0259 5.8568 4.4594 53.8433 66.0732 36.5666 0.6897 6.6142 0.5706 71.1995 7.6156 2.8866 1.5008 15.7374 44.9885 43.5192 60.6222 65.5297 223.6375 60.1574 0.1212 0.1174 3.1108 8.6599 9.2748 2.9092 125.1887 83.6129 27.8412 62.9654 37.6569 157.0689 193.1975 31.5603 30.7468 142.5763 13.6842 22.9619 16.0500 40.0236 31.9932 176.9462 13.8912 0.8382 99.9356 131.7714 60.3048 4.4029 181.6170 68.9728 67.8901 0.4687 32.5925 52.1845 2.2747 41.9008 7.8453 25.2961 14.4240 9.8779 6.0321 14.9342 20.8683
temp: 298.150 k
press: 1.00000 atm
elementType: 8 8 8 8 8 6 6 6 6 6 6 6 6 6 6 6 6 1 1 1 1 1 1 1 1 1 1 1 1 1 1
symmnumber: 1
zpe: 628886.7 jmol-1
zpe.correction: 0.239530 hartree
zpe.thermalcorrener: 0.257051 hartree
zpe.thermalcorrenthalpy: 0.257996 hartree
zpe.thermalcorrgfe: 0.191635 hartree
zpe.sumelectzpe: -840.500871 hartree
zpe.sumelectthermal: -840.483350 hartree
zpe.sumelectthermalent: -840.482406 hartree
zpe.sumelectthermalfe: -840.548766 hartree
dipole: -3.5438 4.7315 1.0034
dipole: 5.9960
quadrupole: -73.2882 -98.2230 -101.3661
quadrupole: -6.4358 2.1514 1.5921
quadrupole: 17.6709 -7.2639 -10.4070 -6.4358 2.1514 1.5921
hfenergy: -840.7404012 hartree
pointgroup: C01 [X(C12H14O5)]
dipole: -1.6532394 0.8685746 1.4413011 debye
polarizability: 210.9896416|20.2865001|137.4905782|-2.9686017|41.4047053|111.3703132 unknown
InChI: InChI=1S/C12H14O5/c1-16-8-3-5-11(17-2)9(7-8)10(13)4-6-12(14)15/h3,5,7,14H,4,6H2,1-2H3
charge 0 multiplicity 1
31 atoms
O  -0.020548 1.465545 1.318212
O  -3.669245 -2.132452 -1.046296
O  1.166392 -1.467936 -1.499762
O  5.798351 0.074402 -0.214107
O  4.402266 1.88711 0.163233
C  -0.511925 -0.404269 -0.153101
C  2.05909 0.166637 0.050807
C  0.917735 -0.617707 -0.589177
C  3.433591 -0.317765 -0.433496
C  -0.973939 0.593309 0.770308
C  -1.468529 -1.278571 -0.724549
C  -2.838858 -1.197673 -0.406226
C  -2.350632 0.674237 1.08637
C  -3.284025 -0.212884 0.508733
C  4.531329 0.674453 -0.12192
C  -0.481574 2.515139 2.231853
C  -5.099644 -2.081235 -0.741096
H  1.926314 1.243205 -0.171041
H  1.971591 0.113902 1.151558
H  3.700601 -1.300278 -0.007497
H  3.410055 -0.48042 -1.529131
H  -1.115476 -2.03326 -1.433832
H  -2.713735 1.431451 1.786658
H  -4.340367 -0.12216 0.77876
H  -0.945759 2.083133 3.139338
H  -1.1964 3.196293 1.731474
H  0.428324 3.068263 2.506359
H  -5.550237 -2.883154 -1.343788
H  -5.540901 -1.10671 -1.030062
H  -5.291568 -2.271743 0.333535
H  6.495922 0.764432 -0.04292
