program: Gaussian 09
title: 000266053
version: EM64L-G09RevD.01
frameworkgroup: C1[X(C12H16O4)]
method: RPBEPBE
basis: SDD
operation: Freq
keyword: #pfreq=noraman
keyword: PBEPBE/SDD
title: #p freq=noraman PBEPBE/SDD
converged: NO YES NO NO
title: Mulliken charges:
elementType: O O O O C C C C C C C C C C C C H H H H H H H H H H H H H H H H
charge: -0.274890 -0.269585 -0.421251 -0.233674 -0.546652 -0.385458 0.407782 -0.471401 0.152473 -0.549488 0.320738 -0.336368 -0.378205 0.179046 -0.536568 -0.536521 0.195697 0.232578 0.257779 0.214464 0.236567 0.270409 0.247784 0.239094 0.248566 0.243980 0.218845 0.219654 0.218224 0.244035 0.218574 0.373772
chargesum: 0.00000
title: Mulliken charges with hydrogens summed into heavy atoms:
elementType: O O O O C C C C C C C C C C C C
charge: -0.274890 -0.269585 -0.047480 -0.233674 -0.118376 0.086785 0.407782 0.035574 0.152473 -0.301703 0.320738 -0.097274 -0.129640 0.179046 0.145911 0.144312
polarizability: 1.51527615e+02 1.88776089e+01 1.71676498e+02 1.51038486e+01 -7.20897708e+00 1.08633219e+02
1716.lowfreq: -11.5815 -7.0353 -0.0008 -0.0006 0.0005 3.3733 13.6757 22.5694 37.2307
frequency: 13.5039 22.5316 37.1961 64.2705 84.1591 100.6101 134.9771 142.7924 160.2864 181.3179 204.0057 238.2775 246.2801 260.6470 307.1825 365.1758 391.5392 422.0902 424.9150 444.2079 466.7101 503.7143 515.5435 574.9824 586.5160 624.1560 640.5019 672.6438 716.0907 731.0996 781.7455 806.6507 835.7524 861.3256 890.5072 901.8743 926.6920 983.2283 989.2231 1006.9642 1021.0304 1064.1723 1077.3925 1113.0756 1113.3408 1113.6658 1147.0442 1153.9031 1157.4967 1175.4849 1197.2700 1205.9138 1242.7819 1253.6496 1275.7398 1288.2137 1313.2014 1330.6520 1368.4360 1382.3606 1415.3451 1438.0667 1439.4381 1442.9535 1458.4038 1466.0624 1466.8138 1470.9410 1475.0046 1475.2633 1496.1806 1593.9387 1618.5598 1668.6543 2952.7662 2956.3866 2983.1772 2986.8820 3007.4363 3036.2167 3037.6642 3042.6487 3046.6240 3082.7476 3120.8456 3121.7295 3143.3603 3152.2911 3173.6136 3509.6104
redmass: 11.8695 5.0067 5.6599 3.0160 2.3776 3.4506 3.4048 4.3651 2.9811 3.1818 2.7107 1.4797 1.6432 1.4943 2.7913 4.8203 3.8080 4.0595 4.8687 3.9869 3.3840 2.1542 2.7048 3.6125 4.2253 3.2568 1.3724 5.3681 3.4673 3.1073 1.7254 1.5265 2.2438 1.7286 3.9440 2.7558 1.3516 3.5114 6.7664 2.9270 2.4812 2.3039 2.3469 1.4589 1.3044 1.4494 1.4479 1.2765 1.3869 1.4871 2.2095 1.4830 1.6080 2.6854 1.1736 1.5131 1.5057 1.4805 1.9275 5.4418 2.4192 1.2097 1.0915 1.3433 1.1543 1.0503 1.0518 1.1441 1.0575 1.0992 2.1057 8.0816 6.5427 8.1393 1.0333 1.0331 1.0610 1.0611 1.0643 1.0967 1.1037 1.1037 1.1001 1.1002 1.0987 1.0991 1.0902 1.0872 1.0965 1.0638
irintensity: 1.0873 0.0901 0.0654 6.9870 0.3807 0.3884 1.6200 11.2181 1.4936 3.8764 1.0358 0.1956 0.3905 1.2377 0.8846 1.1028 2.7125 19.2159 2.5777 7.7124 17.0753 27.2513 3.1802 2.8441 14.6351 2.8387 122.9447 25.0546 15.7144 5.0958 15.7089 51.8499 3.3535 20.6972 8.1300 29.6632 0.0934 17.1405 47.5085 75.9293 96.8491 140.9375 4.1998 8.9758 4.1504 8.9900 4.0505 3.1058 2.6277 56.5299 204.4774 66.3760 0.7531 1.7565 7.3338 14.0941 30.9793 14.7198 48.3935 21.3779 43.3880 5.5158 21.8751 2.8469 11.6305 13.6191 14.3200 179.2337 0.8353 5.9666 111.9816 2.9635 16.3769 208.4949 80.7766 60.2043 30.4575 14.0360 37.6818 4.6743 52.5241 49.2659 16.7449 26.0789 30.7947 19.9210 12.9018 7.6055 8.5109 17.0805
temp: 298.150 k
press: 1.00000 atm
elementType: 8 8 8 8 6 6 6 6 6 6 6 6 6 6 6 6 1 1 1 1 1 1 1 1 1 1 1 1 1 1 1 1
symmnumber: 1
zpe: 679098.1 jmol-1
zpe.correction: 0.258655 hartree
zpe.thermalcorrener: 0.275583 hartree
zpe.thermalcorrenthalpy: 0.276527 hartree
zpe.thermalcorrgfe: 0.211292 hartree
zpe.sumelectzpe: -766.533247 hartree
zpe.sumelectthermal: -766.516318 hartree
zpe.sumelectthermalent: -766.515374 hartree
zpe.sumelectthermalfe: -766.580609 hartree
dipole: -1.0530 -0.6228 0.3897
dipole: 1.2840
quadrupole: -103.4234 -78.1612 -92.0854
quadrupole: -6.5077 -0.9248 -6.5169
quadrupole: -12.2000 13.0621 -0.8621 -6.5077 -0.9248 -6.5169
hfenergy: -766.7919014 hartree
pointgroup: C01 [X(C12H16O4)]
dipole: 0.3104662 0.357576 0.1758749 debye
polarizability: 142.3181888|9.5233889|180.7359385|-15.8400275|5.9413369|108.7832041 unknown
InChI: InChI=1S/C12H16O4/c1-15-10-6-7-11(16-2)9(8-10)4-3-5-12(13)14/h6-8,13H,3-5H2,1-2H3
charge 0 multiplicity 1
32 atoms
O  0.956888 -2.49477 0.141399
O  2.406882 2.940473 -0.302711
O  -4.370567 0.847956 -0.961126
O  -4.085833 -1.446393 -0.764492
C  -0.47338 -0.688414 1.734401
C  -1.781809 -1.089548 0.995242
C  0.633146 -0.213743 0.805175
C  -2.437958 0.098699 0.26717
C  1.342717 -1.144339 -0.005765
C  0.97711 1.156466 0.716472
C  2.001185 1.599345 -0.157762
C  2.365481 -0.704962 -0.881727
C  2.69264 0.663338 -0.958182
C  -3.67842 -0.29223 -0.508217
C  1.67363 -3.491834 -0.653349
C  1.724726 3.940424 0.517667
H  -0.696702 0.104878 2.474628
H  -0.121717 -1.57487 2.294297
H  -1.559758 -1.89459 0.274143
H  -2.494395 -1.511142 1.729488
H  -2.712925 0.907577 0.971344
H  -1.725813 0.554726 -0.449552
H  0.434812 1.866253 1.35028
H  2.91576 -1.415037 -1.506026
H  3.480717 1.020219 -1.627783
H  1.223912 -4.457261 -0.377814
H  2.754746 -3.501373 -0.411631
H  1.539416 -3.316076 -1.73878
H  0.640621 3.980389 0.291323
H  2.192107 4.900094 0.251659
H  1.868303 3.744107 1.598754
H  -5.164221 0.554141 -1.486426
