program: Gaussian 09
title: 000024851
version: EM64L-G09RevD.01
frameworkgroup: C1[X(C10H16O6)]
method: RPBEPBE
basis: SDD
operation: Freq
keyword: #pfreq=noraman
keyword: PBEPBE/SDD
title: #p freq=noraman PBEPBE/SDD
converged: YES YES NO NO
title: Mulliken charges:
elementType: O O O O O O C C C C C C C C C C H H H H H H H H H H H H H H H H
charge: -0.300857 -0.301849 -0.277059 -0.278497 -0.239943 -0.238106 -0.043346 -0.043851 -0.043473 -0.041148 -0.347974 -0.349469 -0.261796 -0.271174 -0.294993 -0.291770 0.244441 0.243450 0.240010 0.234912 0.226087 0.218753 0.225706 0.219684 0.209153 0.224706 0.206608 0.236564 0.222019 0.225366 0.221977 0.225867
chargesum: 0.00000
title: Mulliken charges with hydrogens summed into heavy atoms:
elementType: O O O O O O C C C C C C C C C C
charge: -0.300857 -0.301849 -0.277059 -0.278497 -0.239943 -0.238106 0.201095 0.199599 0.196538 0.193765 0.096866 0.095921 0.172064 0.171997 0.152392 0.156074
polarizability: 1.53622943e+02 -7.31828717e+00 1.22222203e+02 3.33362265e+00 -2.90472472e+00 9.89709149e+01
1716.lowfreq: -4.9688 -0.0006 -0.0005 0.0005 3.4875 7.0209 21.6903 28.4507 37.2170
frequency: 21.5489 27.8071 37.1643 45.6181 60.6675 83.1662 96.5546 123.1277 143.9951 179.1895 214.7845 224.3659 260.8914 268.8525 316.1852 387.5330 399.6545 410.3556 418.0767 468.6435 513.8544 571.8294 617.4127 736.6758 750.4893 753.5540 782.5493 794.0130 795.2177 801.4040 865.4181 883.4506 889.9327 891.2126 947.9670 958.0686 970.8218 992.5345 997.6187 1019.6377 1022.0811 1028.0774 1038.2749 1047.9204 1089.3177 1096.5827 1097.1390 1107.5751 1111.4843 1111.8908 1139.2289 1140.5764 1200.9586 1203.5868 1214.3212 1238.0299 1238.2489 1247.9950 1259.9065 1303.5329 1322.4878 1327.9875 1348.1439 1357.7143 1361.9047 1362.9482 1413.4185 1417.2198 1443.4062 1444.8230 1474.9796 1475.5321 1485.0723 1486.9549 2963.3282 2970.7201 3002.6769 3008.1948 3025.6449 3031.7430 3041.3849 3042.3865 3068.8799 3069.6030 3095.3588 3100.2882 3111.2290 3114.0742 3178.1140 3178.7499
redmass: 4.9898 3.1731 3.8655 3.7966 4.4770 4.6206 3.9431 3.6177 4.3388 4.3932 6.7355 5.0106 4.1662 3.3371 3.0540 2.3834 2.7484 4.0814 4.8032 6.1947 2.5169 5.8221 6.7833 3.5818 7.5584 5.6821 5.2965 4.2454 4.3411 3.2945 3.0900 4.5543 1.2672 1.2175 3.1366 3.5550 1.8787 9.2889 2.9761 2.3375 1.6106 1.4951 2.3373 7.8636 2.0837 1.4372 1.3759 2.5155 1.3195 1.3970 1.5418 1.5573 1.3103 1.3191 1.1383 1.4327 1.4385 1.2005 1.1615 1.2162 1.3365 1.1988 1.3510 1.2909 1.4733 1.2966 1.9381 1.9027 1.0970 1.0937 1.2074 1.2181 1.1226 1.1237 1.0615 1.0589 1.0655 1.0589 1.0858 1.0868 1.1032 1.1006 1.0531 1.0530 1.1002 1.1062 1.0918 1.0919 1.1190 1.1191
irintensity: 0.1111 0.8338 2.5594 1.5646 1.2868 1.5589 1.7753 6.7223 11.8036 9.5626 1.0675 17.4607 9.0528 18.1882 4.7445 8.1699 1.7521 0.2276 9.5788 3.7436 14.1486 12.9328 1.5847 10.0878 0.1171 20.0308 18.2743 45.0325 22.3056 37.2988 116.3847 54.3454 0.5459 12.8750 23.8008 12.4607 12.5709 349.3724 86.5530 10.8993 5.5026 4.6792 4.4907 212.4380 6.4567 4.8880 9.4166 91.9494 3.1240 12.7186 5.3784 9.0803 0.4530 2.5999 0.4786 3.5580 0.7683 19.9145 8.9743 5.6650 0.3877 6.6961 10.5480 0.0857 2.0455 0.7387 1.2458 0.1919 6.4102 6.2106 6.4054 3.4671 6.0390 4.0991 43.7573 38.7696 36.7508 37.6210 29.3076 33.7177 17.1452 21.1967 24.1452 26.7203 27.7966 23.7205 17.3670 17.5698 31.3517 30.4691
temp: 298.150 k
press: 1.00000 atm
elementType: 8 8 8 8 8 8 6 6 6 6 6 6 6 6 6 6 1 1 1 1 1 1 1 1 1 1 1 1 1 1 1 1
symmnumber: 1
zpe: 672202.9 jmol-1
zpe.correction: 0.256029 hartree
zpe.thermalcorrener: 0.272628 hartree
zpe.thermalcorrenthalpy: 0.273572 hartree
zpe.thermalcorrgfe: 0.208414 hartree
zpe.sumelectzpe: -840.568372 hartree
zpe.sumelectthermal: -840.551773 hartree
zpe.sumelectthermalent: -840.550828 hartree
zpe.sumelectthermalfe: -840.615986 hartree
dipole: -0.2905 1.3199 0.1019
dipole: 1.3554
quadrupole: -118.8571 -82.4389 -97.9975
quadrupole: -8.3250 14.4534 1.2565
quadrupole: -19.0926 17.3256 1.7670 -8.3250 14.4534 1.2565
hfenergy: -840.8244004 hartree
pointgroup: C01 [X(C10H16O6)]
dipole: 0.131362 -0.5139984 0.0537609 debye
polarizability: 153.9728516|-6.3808615|121.934747|-3.8774865|2.1939742|98.9084622 unknown
InChI: InChI=1S/C10H16O6/c1-2-12-10(16-6-8-4-14-8)9(11-1)15-5-7-3-13-7/h7-10H,1-6H2
charge 0 multiplicity 1
32 atoms
O  5.305603 1.474448 0.186067
O  -5.527926 0.603736 -0.402737
O  1.707662 0.455679 -0.296242
O  -1.839232 0.149749 0.227598
O  0.770339 -0.999061 1.391756
O  -0.590629 -1.420814 -1.122922
C  3.938259 1.32404 -0.442439
C  -4.237779 0.192015 0.270145
C  0.535288 0.133256 0.505101
C  -0.607925 -0.098245 -0.51198
C  5.036534 0.384208 -0.827676
C  -4.899775 1.473866 0.664705
C  2.853805 0.905067 0.524044
C  -3.034557 0.177962 -0.645056
C  0.857536 -2.28762 0.657793
C  -0.436267 -2.507322 -0.121858
H  3.672429 2.131983 -1.13557
H  -4.335061 -0.674779 0.93605
H  0.273574 0.96092 1.191355
H  -0.500244 0.594033 -1.36797
H  5.54538 0.513941 -1.789938
H  5.036439 -0.633066 -0.416434
H  -5.460175 1.525363 1.605452
H  -4.486243 2.421864 0.298375
H  2.543372 1.760934 1.160488
H  3.205571 0.089011 1.18266
H  -3.021079 1.085772 -1.282833
H  -3.043835 -0.717025 -1.296258
H  1.006649 -3.049749 1.439548
H  1.724922 -2.26828 -0.029689
H  -0.413287 -3.437109 -0.712647
H  -1.305147 -2.509575 0.56361
