program: Gaussian 09
title: 000266059
version: EM64L-G09RevD.01
frameworkgroup: C1[X(C12H16F3NO7)]
method: RPBEPBE
basis: SDD
operation: Freq
keyword: #p
keyword: freq=noraman
keyword: PBEPBE/SDD
title: #p freq=noraman PBEPBE/SDD
converged: YES YES NO NO
title: Mulliken charges:
elementType: F F F O O O O O O O N C C C C C C C C C C C C H H H H H H H H H H H H H H H H
charge: -0.141934 -0.138793 -0.175883 -0.237522 -0.267054 -0.246715 -0.264476 -0.224245 -0.240171 -0.249416 -0.359967 -0.061553 -0.150485 -0.124884 -0.083177 -0.410422 0.186937 0.327730 0.316944 -0.501097 0.306031 -0.774915 -0.763220 0.309117 0.314312 0.288655 0.281603 0.244401 0.252783 0.362721 0.220574 0.233894 0.240266 0.244739 0.283736 0.243144 0.259787 0.247633 0.250923
chargesum: 0.00000
title: Mulliken charges with hydrogens summed into heavy atoms:
elementType: F F F O O O O O O O N C C C C C C C C C C C C
charge: -0.141934 -0.138793 -0.175883 -0.237522 -0.267054 -0.246715 -0.264476 -0.224245 -0.240171 -0.249416 0.002754 0.247564 0.163827 0.163771 0.198427 0.086762 0.186937 0.327730 0.316944 0.193637 0.306031 -0.003296 -0.004877
polarizability: 1.76547128e+02 -1.12369300e+01 1.56793784e+02 6.45281262e+00 2.15432831e-02 1.44073590e+02
1716.lowfreq: -61.4085 -6.2132 -3.6065 -0.0007 -0.0006 0.0007 7.1950 16.5122 23.8037
frequency: -61.3735 16.1997 23.7298 36.9457 41.8144 47.1804 53.2441 69.0847 78.8401 83.7506 103.9770 117.0546 123.3524 128.2747 153.7592 175.5381 193.6837 204.2646 217.7137 244.8416 251.6238 269.6306 286.5439 302.2352 327.2331 354.3322 360.4465 379.6556 421.5020 443.1871 455.1809 471.3308 517.3364 554.1747 563.1797 573.3303 596.9302 616.0049 633.4251 639.8221 671.1034 705.0275 711.8783 716.7982 803.4147 826.1298 843.0806 848.8315 859.5161 924.1077 926.5411 943.6848 986.2485 997.5563 1000.3853 1009.3259 1011.2824 1022.9379 1034.3125 1040.7091 1045.4147 1047.8462 1082.6917 1104.7760 1115.2638 1143.8629 1146.7516 1162.6549 1185.7622 1199.4008 1228.2826 1238.2430 1246.5368 1280.7239 1300.0861 1307.9725 1326.6134 1338.5430 1347.4616 1353.4393 1377.1792 1383.0580 1387.9646 1433.8924 1452.4741 1453.2980 1454.6854 1456.6598 1457.1864 1458.9779 1476.2937 1492.4391 1641.8997 1651.9956 1661.7419 2967.6312 3003.7518 3010.3748 3024.4799 3038.4305 3051.6930 3054.5691 3058.0014 3061.5812 3097.5813 3099.5072 3112.4600 3127.2477 3141.5181 3143.1639 3498.5485
redmass: 1.0352 16.0454 7.5309 7.5679 7.1610 5.9770 8.6845 4.0091 3.1925 4.7455 4.0532 1.1310 3.5298 2.8528 1.5911 7.1912 5.2058 7.8577 6.1031 6.3371 8.4909 5.2140 5.5848 4.2442 5.2047 4.2963 6.2730 10.3379 3.5794 11.2744 4.3744 4.5113 9.0978 3.3765 3.9656 3.5832 4.4039 6.5621 5.4936 8.2085 3.7950 5.2873 1.6166 4.4452 5.9789 5.5489 5.7854 3.7999 4.6709 5.3250 2.6066 4.2968 2.7187 2.1157 4.8168 3.5719 4.9095 6.4023 5.5133 3.2357 1.6738 1.6499 3.2950 3.4133 1.2977 2.2108 2.4574 1.9347 3.1815 3.2313 1.7001 1.6035 1.3081 1.7601 1.3661 1.1732 1.4185 1.2732 1.2897 1.2616 1.4993 1.2841 1.2525 1.1482 1.0573 1.0906 1.0637 1.0551 1.0536 1.0517 1.0531 1.9137 10.6626 11.0815 9.9970 1.0325 1.0384 1.0368 1.0620 1.0846 1.0857 1.0864 1.0855 1.1028 1.0971 1.0940 1.1050 1.1015 1.1023 1.1012 1.0780
irintensity: 0.9979 0.0630 0.2532 0.4971 1.1513 0.7306 0.9361 0.7157 3.3304 6.5990 6.1224 1.4574 2.0934 1.4548 0.6636 0.3774 7.9745 5.6706 0.5011 3.7525 18.5006 13.8207 5.0975 7.2278 10.9374 10.8436 12.6085 2.8803 11.4193 12.4103 20.9329 8.0239 1.3689 14.8735 3.0703 3.9372 1.9153 13.5625 2.3146 6.1883 18.6545 14.9885 109.5644 3.4712 9.3718 61.4837 40.2575 40.8161 21.8974 147.4289 6.6975 39.6934 32.7310 83.5630 55.3398 76.6218 23.8277 307.6610 145.9597 125.6652 4.6842 9.5068 50.3445 54.0757 3.8693 117.1220 46.5063 14.5159 408.7562 229.3796 46.9925 21.2343 12.2093 9.6695 6.4478 3.8769 0.6402 7.3965 9.5712 3.6883 20.8900 62.0447 48.9473 9.0469 16.5734 10.0990 13.9395 29.2601 5.6186 12.2255 16.0630 170.7717 211.3908 247.3266 144.5577 57.8008 1.7000 1.9242 23.7738 5.6465 15.9570 1.7667 11.2871 34.3923 4.8141 5.1875 10.3437 16.6440 8.5115 6.4428 67.3385
temp: 298.150 k
press: 1.00000 atm
elementType: 9 9 9 8 8 8 8 8 8 8 7 6 6 6 6 6 6 6 6 6 6 6 6 1 1 1 1 1 1 1 1 1 1 1 1 1 1 1 1
symmnumber: 1
zpe: 747342.1 jmol-1
zpe.correction: 0.284648 hartree
zpe.thermalcorrener: 0.308477 hartree
zpe.thermalcorrenthalpy: 0.309421 hartree
zpe.thermalcorrgfe: 0.227936 hartree
zpe.sumelectzpe: -1345.937219 hartree
zpe.sumelectthermal: -1345.913390 hartree
zpe.sumelectthermalent: -1345.912445 hartree
zpe.sumelectthermalfe: -1345.993930 hartree
dipole: 4.9543 -1.2257 -0.6503
dipole: 5.1449
quadrupole: -133.5372 -124.0014 -141.9038
quadrupole: -1.6024 -1.3235 16.7741
quadrupole: -0.3898 9.1461 -8.7563 -1.6024 -1.3235 16.7741
hfenergy: -1346.2218664 hartree
pointgroup: C01 [X(C12H16F3N1O7)]
dipole: -1.8801034 0.5868552 -0.466936 debye
polarizability: 176.3011544|-12.2094463|158.0700917|-2.8499073|-1.0452451|143.0432559 unknown
InChI: InChI=1S/C12H16F3NO7/c1-5(17)22-8-7(16-11(19)12(13,14)15)4-21-10(20-3)9(8)23-6(2)18/h7-10,16H,4H2,1-3H3
charge 0 multiplicity 1
39 atoms
F  4.691123 1.085634 1.025837
F  3.656351 -0.450749 2.331093
F  2.769561 1.630223 2.110336
O  -0.853774 2.365571 -0.563512
O  0.078867 -1.703244 -0.174628
O  -2.590878 -0.871443 0.3916
O  -2.866954 1.293451 -1.36138
O  3.068597 -0.89579 -0.495089
O  0.36397 -2.605097 -2.308086
O  -3.245643 0.250025 2.326013
N  1.492366 0.794336 -0.067396
C  -0.528216 -0.510257 -0.800347
C  0.597436 0.489999 -1.199434
C  -1.484344 0.098855 0.227037
C  -2.001418 1.490129 -0.229993
C  -0.052547 1.798116 -1.677113
C  2.631025 0.076595 0.175616
C  0.53958 -2.693355 -1.074528
C  -3.403591 -0.696561 1.52065
C  -3.659106 2.48934 -1.703541
C  3.435955 0.581532 1.407387
C  1.266723 -3.78158 -0.330591
C  -4.452144 -1.780252 1.60461
H  -1.074347 -0.808969 -1.713372
H  1.200603 0.026592 -2.000159
H  -0.986623 0.234166 1.204782
H  -2.506747 2.018392 0.597784
H  -0.697751 1.612885 -2.554799
H  0.698477 2.567277 -1.912988
H  1.220877 1.565949 0.551942
H  -4.304589 2.782628 -0.852448
H  -3.002198 3.335706 -1.976468
H  -4.281616 2.197567 -2.562148
H  0.812623 -3.961802 0.656238
H  2.308861 -3.447058 -0.172296
H  1.276919 -4.704356 -0.929389
H  -4.378979 -2.474494 0.755879
H  -5.45503 -1.320093 1.626555
H  -4.326621 -2.334864 2.550845
