program: Gaussian 09
title: 000266034
version: EM64L-G09RevD.01
frameworkgroup: C1[X(C8H8O8)]
method: RPBEPBE
basis: SDD
operation: Freq
keyword: #p
keyword: freq=noraman
keyword: PBEPBE/SDD
title: #p freq=noraman PBEPBE/SDD
converged: NO YES NO NO
title: Mulliken charges:
elementType: O O O O O O O O C C C C C C C C H H H H H H H H
charge: -0.398946 -0.398911 -0.411496 -0.411498 -0.231912 -0.231936 -0.215043 -0.215058 -0.290895 -0.290860 -0.231929 -0.231849 0.175431 0.175430 0.163074 0.163065 0.339608 0.339598 0.330564 0.330586 0.383150 0.383150 0.388344 0.388333
chargesum: 0.00000
title: Mulliken charges with hydrogens summed into heavy atoms:
elementType: O O O O O O O O C C C C C C C C
charge: -0.015796 -0.015760 -0.023152 -0.023166 -0.231912 -0.231936 -0.215043 -0.215058 0.048713 0.048737 0.098634 0.098738 0.175431 0.175430 0.163074 0.163065
polarizability: 1.21767801e+02 7.98960695e-04 9.55615502e+01 -2.59734108e+00 7.90312640e-04 1.00366301e+02
1716.lowfreq: -5.7626 -4.3966 0.0006 0.0006 0.0008 7.2613 21.6160 39.9570 42.8548
frequency: 21.5807 39.9470 42.8418 66.5273 71.6336 104.8259 106.7257 117.7716 121.4675 160.1349 231.2264 232.8645 309.9706 340.6016 377.2121 401.6235 504.8450 531.5505 555.4785 560.1734 584.3229 593.5812 598.1788 610.6452 628.5763 642.7870 683.6721 684.9547 741.9416 793.1749 797.3045 826.3480 926.5954 978.7648 980.4103 999.8256 1014.3505 1042.9819 1059.5723 1061.8634 1081.6853 1112.8192 1147.2597 1196.5347 1196.5440 1239.1612 1243.0843 1255.1076 1258.1093 1266.0731 1320.4993 1363.5736 1372.2415 1403.5081 1649.5255 1654.0199 1656.6018 1664.4495 3057.6766 3058.9497 3087.6105 3094.4664 3509.0939 3509.1506 3519.2190 3519.4407
redmass: 8.9712 9.9575 11.0733 9.6470 10.3574 8.0146 7.6863 7.8451 7.4687 6.1978 9.8527 6.7208 8.2167 7.6327 5.5158 4.7875 3.3449 4.5693 2.1504 3.4432 2.3697 2.0855 2.8189 1.7166 1.7298 2.0275 2.6126 2.5450 5.8124 5.3949 3.4411 5.8536 6.2895 3.3022 3.4404 4.4515 4.2069 3.9936 1.9789 2.0335 2.0597 1.8169 1.4564 1.3159 1.3186 1.2814 1.3662 1.6422 1.4336 1.6347 2.4854 2.0261 2.4250 2.0756 9.1194 8.9771 9.1053 8.5818 1.0864 1.0834 1.0876 1.0856 1.0640 1.0640 1.0642 1.0641
irintensity: 1.6700 1.8416 1.1473 2.2501 0.7356 1.1416 1.1876 0.0756 5.8639 0.1982 0.1682 0.7518 0.0251 0.0438 0.1522 3.5302 119.2260 55.7119 36.5152 28.4294 30.4663 134.0450 79.0072 55.4568 226.6670 18.4270 20.7551 1.2157 59.1041 3.1449 2.5294 10.3797 12.7496 69.0449 0.4734 2.5821 18.4510 39.9550 118.4601 79.7427 632.8294 26.7649 112.2533 5.2342 9.2484 9.2527 3.7481 6.8956 0.2856 0.6097 226.3506 21.7352 1.7921 49.8250 53.8384 60.7517 620.6482 54.0915 1.3051 17.7097 0.0301 1.5498 38.3703 23.2900 76.4814 1.5988
temp: 298.150 k
press: 1.00000 atm
elementType: 8 8 8 8 8 8 8 8 6 6 6 6 6 6 6 6 1 1 1 1 1 1 1 1
symmnumber: 1
zpe: 428174.9 jmol-1
zpe.correction: 0.163083 hartree
zpe.thermalcorrener: 0.178817 hartree
zpe.thermalcorrenthalpy: 0.179761 hartree
zpe.thermalcorrgfe: 0.117348 hartree
zpe.sumelectzpe: -910.250947 hartree
zpe.sumelectthermal: -910.235213 hartree
zpe.sumelectthermalent: -910.234269 hartree
zpe.sumelectthermalfe: -910.296682 hartree
dipole: 0.0002 0.9720 0.0001
dipole: 0.9720
quadrupole: -68.6739 -88.4070 -105.0603
quadrupole: -0.0003 -8.9868 -0.0037
quadrupole: 18.7065 -1.0266 -17.6799 -0.0003 -8.9868 -0.0037
hfenergy: -910.41403 hartree
pointgroup: C01 [X(C8H8O8)]
dipole: 0.0001563 -0.382413 0.0001751 debye
dipolederiv: -0.4575449 -0.1536795 -0.389869 -0.1379496 -0.5696608 -0.3793487 -0.3212533 -0.3489593 -0.8938232 -0.4582708 0.1538809 -0.3914124 0.1376235 -0.5680015 0.3772826 -0.322004 0.3481552 -0.894702 -1.070073 0.0023901 -0.444303 -0.0351898 -0.4166105 0.0130029 -0.3811091 0.0238634 -0.4693532 -1.069857 -0.0032182 -0.4442717 0.0343028 -0.416464 -0.0134627 -0.3811377 -0.0242616 -0.4693421 -0.5909407 -0.1802227 0.2179948 -0.1952581 -0.4693961 0.0554971 0.0207755 -0.0466742 -0.8212733 -0.5914625 0.1805528 0.2185085 0.1948055 -0.4688319 -0.0548368 0.0200826 0.0457426 -0.8212541 -0.6441158 0.1650188 0.0637546 -0.0062268 -0.4644303 -0.2643533 -0.1498272 -0.3201674 -0.7514637 -0.6439044 -0.1651523 0.0636365 0.0060218 -0.4642612 0.2643466 -0.1501297 0.3196515 -0.7518222 -0.1112936 -0.1703993 -0.0357849 -0.2428437 -0.0791666 -0.0068129 0.0600731 -0.0148074 0.0216763 -0.1109967 0.1697128 -0.0358398 0.2434831 -0.0794101 0.0069109 0.0603629 0.0149282 0.0217754 -0.1502445 0.1087383 0.0514297 0.1709795 0.0674531 -0.1023242 0.2396637 -0.1191557 -0.0372915 -0.1500533 -0.1086648 0.0514216 -0.1709276 0.0680605 0.1021113 0.2398145 0.1191424 -0.0374388 0.8876545 0.6080837 0.0838919 0.5601662 0.6860561 0.284639 0.1045299 0.3202398 1.3697827 0.8894448 -0.6079264 0.0852309 -0.5596116 0.6829695 -0.2832318 0.1059419 -0.3188285 1.3705003 1.465677 -0.3021426 0.2422387 -0.0760365 0.4710652 0.3947533 0.2394423 0.4923264 1.0156472 1.4650686 0.3031369 0.2423868 0.0769735 0.4709164 -0.3942481 0.2398547 -0.491466 1.0162521 0.0712366 -0.0129506 0.0506928 0.0099526 0.0579342 -0.0217083 0.0151982 -0.0155371 0.03124 0.0712888 0.0129792 0.0506612 -0.0099122 0.0580499 0.0217507 0.0152908 0.0155634 0.0312123 0.1097601 0.0303966 0.0107992 0.0356307 0.0400409 0.0178689 -0.0679653 0.0412303 0.0489753 0.1098543 -0.0302906 0.0108257 -0.0356102 0.0398861 -0.0178311 -0.0679429 -0.0411877 0.0490491 0.2033495 -0.1002642 0.0852625 -0.0873834 0.3460611 0.0443833 0.1238831 0.0670243 0.2796381 0.2027872 0.1000554 0.0852203 0.0869703 0.3465791 -0.04434 0.1238465 -0.0668609 0.2797373 0.2863159 0.0257907 0.0637932 0.0359237 0.3305495 -0.0759311 0.1163474 -0.1072178 0.2062007 0.2863199 -0.025825 0.0637324 -0.0358838 0.3306117 0.0758824 0.1162619 0.1072562 0.2060771 unknown
polarizability: 121.4904344|0.01819|95.5615629|3.5503556|0.0033881|100.6436543 unknown
InChI: InChI=1S/C8H8O8/c9-5(10)1-2(6(11)12)4(8(15)16)3(1)7(13)14/h1-4,9,11,13,15H
charge 0 multiplicity 1
24 atoms
O  -2.245898 -1.92941 -1.523079
O  2.250277 -1.92394 1.523043
O  -3.025964 1.358004 -0.401521
O  3.025916 1.36085 0.398402
O  -2.318397 -1.562041 0.770793
O  2.32213 -1.558925 -0.771215
O  -1.846007 2.093655 1.461487
O  1.845371 2.094374 -1.465072
C  -0.528905 -0.543955 -0.576642
C  0.530464 -0.543045 0.575021
C  -0.651845 1.035846 -0.424427
C  0.652084 1.036726 0.421483
C  -1.767451 -1.374222 -0.337342
C  1.769633 -1.372596 0.336399
C  -1.856542 1.547965 0.337551
C  1.856376 1.549163 -0.340908
H  -0.079896 -0.794163 -1.549865
H  0.081684 -0.792794 1.548467
H  -0.577537 1.560651 -1.391501
H  0.577321 1.562296 1.388107
H  -3.083015 -2.437843 -1.340979
H  3.088912 -2.430111 1.341629
H  -3.809625 1.677553 0.122687
H  3.809315 1.680862 -0.125915
