program: Gaussian 09
title: 000266032
version: EM64L-G09RevD.01
frameworkgroup: C1[X(C6H9N3O5)]
method: RPBEPBE
basis: SDD
operation: Freq
keyword: #pfreq=noraman
keyword: PBEPBE/SDD
title: #p freq=noraman PBEPBE/SDD
converged: YES YES NO NO
title: Mulliken charges:
elementType: O O O O O N N N C C C C C C H H H H H H H H H
charge: -0.420034 -0.217432 -0.209173 -0.389411 -0.268904 -0.628555 -0.347259 -0.102395 -0.188928 -0.515476 0.197526 0.163379 -0.106159 0.115266 0.279193 0.285668 0.244267 0.297182 0.327206 0.425092 0.289329 0.393217 0.376403
chargesum: 0.00000
title: Mulliken charges with hydrogens summed into heavy atoms:
elementType: O O O O O N N N C C C C C C
charge: -0.026817 -0.217432 -0.209173 -0.013008 -0.268904 -0.004168 0.077833 -0.102395 0.090265 0.014459 0.197526 0.163379 0.183169 0.115266
polarizability: 1.71118515e+02 1.62632644e+01 1.13122432e+02 3.96722084e+00 -2.57563271e+00 5.69172615e+01
1716.lowfreq: -25.2306 -8.1505 -4.9722 -0.0006 -0.0002 0.0008 4.0738 4.9600 38.4115
frequency: -25.2191 -7.9961 38.4081 56.3168 86.0670 114.9584 148.1507 177.1563 197.3088 264.6844 274.0210 306.2430 341.2370 362.1161 412.0485 431.9644 491.4361 505.7887 526.1167 591.1407 604.7569 616.9969 634.9496 674.7478 696.3085 723.6501 813.1179 854.8202 899.6672 905.6861 953.6389 998.4405 1027.8363 1056.9469 1079.8617 1112.9235 1138.9508 1146.6554 1205.4227 1245.6875 1260.8174 1274.7638 1293.4737 1295.9156 1325.7908 1348.9273 1363.5848 1445.7299 1510.0421 1582.9041 1598.9413 1652.5098 1657.0535 1660.2160 2935.6029 2984.2259 2998.9504 3065.3894 3104.3189 3433.5502 3516.3346 3537.5002 3547.0691
redmass: 11.0953 8.4258 5.7606 7.5315 4.8283 4.3469 7.2410 7.5151 3.7626 3.1278 6.1532 4.5680 4.0477 2.0593 1.8545 3.8543 5.4686 6.0485 2.8006 3.6249 1.1692 5.1862 1.4364 4.8822 3.1965 9.4930 2.4935 6.4514 2.3791 2.3406 2.3782 5.3789 1.5587 2.3436 2.7175 1.4438 1.0721 2.2305 4.0268 1.3474 1.7931 1.3395 1.9053 1.4582 1.6143 1.6315 1.7625 1.0780 2.1381 8.3385 6.3865 1.4743 3.2544 3.8043 1.0900 1.0736 1.0779 1.0910 1.0928 1.0475 1.0642 1.0641 1.0946
irintensity: 0.7665 0.2891 0.3849 0.7527 0.7934 5.3322 1.8966 2.2879 30.0905 12.0504 9.1311 3.2953 17.6767 17.9866 1.3024 48.0829 11.5802 14.9153 52.7977 38.3487 140.7723 12.0320 87.7274 12.3393 54.2843 35.8146 95.1881 49.3684 6.0203 134.4839 6.2590 25.2235 0.3760 259.3757 843.0909 32.6636 123.7108 2.4473 129.7043 0.4614 262.7774 11.2043 24.7374 4.3968 46.3872 107.9523 19.4687 20.7337 271.4616 591.6900 492.4643 223.2518 187.4948 202.8469 910.8388 1.0922 12.8480 0.4213 0.7988 5.7077 37.2797 54.2573 12.4473
temp: 298.150 k
press: 1.00000 atm
elementType: 8 8 8 8 8 7 7 7 6 6 6 6 6 6 1 1 1 1 1 1 1 1 1
symmnumber: 1
zpe: 437293.9 jmol-1
zpe.correction: 0.166556 hartree
zpe.thermalcorrener: 0.179201 hartree
zpe.thermalcorrenthalpy: 0.180146 hartree
zpe.thermalcorrgfe: 0.126280 hartree
zpe.sumelectzpe: -773.360612 hartree
zpe.sumelectthermal: -773.347967 hartree
zpe.sumelectthermalent: -773.347023 hartree
zpe.sumelectthermalfe: -773.400889 hartree
dipole: 5.1350 -4.6650 0.8163
dipole: 6.9854
quadrupole: -76.5849 -92.6057 -76.7988
quadrupole: -7.4699 2.7059 1.6319
quadrupole: 5.4116 -10.6092 5.1976 -7.4699 2.7059 1.6319
hfenergy: -773.5271688 hartree
pointgroup: C01 [X(C6H9N3O5)]
dipole: -2.0524878 0.868504 -1.6081196 debye
dipolederiv: -0.552447 0.1970649 -0.3612005 0.2263392 -0.5556563 0.3000384 -0.3338968 0.2896149 -0.9501523 -0.5773706 0.0933492 -0.2113265 -0.1490939 -0.5202869 0.3448858 0.2977398 0.3226172 -0.9024216 -0.8570193 -0.2622808 0.2047088 -0.0845295 -0.4810743 0.245017 -0.0105689 0.2160715 -0.6392751 -0.7366923 -0.3004191 0.5176916 -0.3391304 -0.5785083 0.2681375 0.6047325 0.2763875 -0.8923237 -1.1178863 0.0337136 -0.1055183 0.1833128 -0.437398 0.1907755 -0.3572991 0.1830142 -0.6884405 -0.9268104 -0.1006432 -0.1184717 -0.1406409 -0.3567996 0.1458534 -0.1653291 0.1476505 -0.3875803 -2.4160882 -0.3992454 0.550548 -0.0475383 -0.4297606 0.234202 0.0374544 0.2013593 -0.7195123 -2.0463538 -0.2796378 0.3938542 -0.4399932 -0.3830526 0.1384639 0.7309397 0.1545413 -0.5231805 0.0427888 0.0576051 -0.0347475 0.2299822 0.373875 -0.0656054 -0.020245 -0.0969368 0.2215398 -0.3692026 0.0102513 -0.0656089 0.0740307 0.0693248 0.0762138 0.0393626 0.1049213 -0.0060718 1.6138337 0.1114097 -0.1354438 0.4071964 0.5569848 -0.6654297 -0.8569085 -0.6648481 1.2326518 1.2655139 0.0723159 0.1561705 -0.0824573 0.5198679 -0.5876282 0.192758 -0.5536139 1.1043007 2.0592324 0.3443282 -0.5003163 0.3053836 0.2447708 -0.1272654 -0.5105205 -0.1460808 0.3872489 2.7144998 0.3496754 -0.4993981 0.1093453 0.5621493 -0.533004 -0.1243864 -0.5281021 1.2174717 0.0731392 0.0265357 0.0373642 -0.01651 -0.0313821 -0.0408076 0.0354275 -0.0485029 0.0363837 0.0887172 -0.0344267 0.0179166 -0.0647888 0.049691 0.0462645 -0.0016716 0.0399394 0.0732629 0.0395363 0.0416478 -0.0048874 0.0523095 -0.0477739 -0.0732816 -0.0440756 -0.0331917 0.0617319 0.2432002 0.1215859 0.0657627 0.0329344 0.1257937 -0.0072853 0.0965779 -0.0164443 0.1671958 0.3097701 0.011119 -0.0883224 -0.0151828 0.1642236 -0.0001911 -0.0281147 -0.000688 0.1036757 0.7359104 -0.0848013 0.2718673 -0.2562227 0.2744787 -0.0559853 0.5288752 -0.0181135 0.3890441 0.0737196 0.0025889 -0.0103931 0.0216086 0.1511774 0.0846841 -0.0388661 0.0876359 0.0437714 0.137226 -0.0694233 0.0277381 -0.0863321 0.3546536 0.039668 0.0801623 0.0431018 0.3530798 0.2027829 0.0576869 -0.1079875 0.0799772 0.3747021 0.0422798 -0.1521476 0.0396672 0.3175997 unknown
polarizability: 170.5003442|14.261103|70.7481939|-11.2074147|-24.2482106|99.9096699 unknown
InChI: InChI=1S/C6H9N3O5/c7-3(5(11)12)1-4(10)8-2-9-6(13)14/h2-3,8,11,13H,1,7H2
charge 0 multiplicity 1
23 atoms
O  -4.205619 0.484835 -1.6953
O  0.035091 -0.90315 2.439422
O  -4.536824 -0.820454 0.199386
O  4.626828 1.322335 -1.326119
O  4.659665 0.199183 0.710453
N  -1.590205 1.025128 -1.123622
N  0.501105 0.269297 0.455296
N  2.597457 0.782797 -0.405257
C  -2.230208 -0.10189 -0.401804
C  -1.857371 -0.087207 1.106346
C  -0.367056 -0.299282 1.410362
C  -3.762571 -0.198082 -0.555269
C  1.87494 0.22832 0.548185
C  4.00232 0.710584 -0.236506
H  -1.831778 -1.037973 -0.844984
H  -2.420359 -0.870601 1.637324
H  -2.166088 0.88093 1.551747
H  -1.969983 1.939097 -0.841851
H  -1.649618 0.930395 -2.144808
H  0.018355 0.741097 -0.361713
H  2.281948 -0.277238 1.440469
H  -5.190439 0.371262 -1.790583
H  5.610011 1.262318 -1.188673
